{"text_format":"1","workbook":"xlsx","n_sheets":12,"sheets":["Kur.Bil.","Ekders Puantaj","Pers. Bil.","Bodro","Kişi Bodrosu","XML Hes.","Bildirge","AGİ","Banka List.","Öd. Emri","Açıklamalar 1","Tah. Tes."],"not_rendered":{"charts":0,"images":0,"macros":1,"external_links":2,"defined_names":25,"comments":0,"pivot_tables":0},"unopened":[],"bounds":{"document_bytes":16777216,"sheet_cells":100000,"rows_first":2000,"rows_last":500,"rows_between":2000,"halvings":0,"cell_chars":16384,"cell_head_chars":4096},"cells_cut":0,"cells_raw":0,"read":"whole","date_system":"1900"}

{"sheet":"Kur.Bil.","index":0,"n_rows":40,"n_cols":54,"rows_kept":40,"cut":false,"hidden":false,"merged":[[25,10,25,22],[19,10,19,22],[20,10,20,22],[21,10,21,22],[23,10,23,22],[24,10,24,22],[4,45,4,54],[17,1,18,9],[17,10,18,22],[2,24,2,26],[2,1,3,1],[2,2,3,5],[7,37,7,40],[8,37,8,40],[8,17,8,23],[7,17,7,23],[12,10,12,22],[11,10,11,22],[13,10,13,22],[14,10,14,22],[15,10,15,22],[16,10,16,22],[11,30,11,38],[12,30,12,38],[14,30,14,38],[15,30,15,38],[17,31,17,38],[18,31,18,38],[20,31,20,38],[21,31,21,38],[23,30,23,38],[24,30,24,38]]}
[]
[null,null,null,null,null,null,null,null,null,null,null,null,null,null,null,null,null,null,null,null,null,null,null,null,null,null,null,null,null,null,"KURUM BİLGİLERİNİ GİRİNİZ"]
[null,"M","İş Kolu Kodu",null,null,null,"Ünite Kodu ",null,null,null,null,null,null,null,null,null,null,"İl",null,null,"İlçe ",null,"Kontrol ",null,"Aracı Kodu"]
[null,null,null,null,null,null,"Yeni ",null,"Eski ",null,"İş Yeri Sıra Numarası ",null,null,null,null,null,null,"Kodu ",null,null,"Kodu ",null,"No"]
[null,"1","8","5","3","2","0","1","0","1","1","1","1","6","5","5","0","0","3","8","1","0","4","9",0,0,"0",null,null,null,null,null,null,null,null,null,null,null,null,null,null,null,null,null,"SGK İşyeri Sicil No:","185320101111655003810 -58000"]
[]
[null,null,null,null,null,null,null,"ÖDEME DÖNEMİNİ SEÇİNİZ"]
[null,"Dönemi ",null,null,null,null,null,null,null,null,null,null,null,null,null,null,null,"EKİM",null,null,null,null,null,null,null,"Fiili Dönem Memur Maaş Katsayısı",null,null,null,null,null,null,null,null,null,null,null,0.11794]
[null,"Bütçe Yılı ",null,null,null,null,null,null,null,null,null,null,null,null,null,null,null,2018,null,null,null,null,null,null,null,"AGİ'ye Esas Asgari Ücret Tutarı",null,null,null,null,null,null,null,null,null,null,null,2029.5]
[]
[]
[null,"KURUMU",null,null,null,null,null,null,null,null,"YAHYALI ÇOK PROGRAMLI ANADOLU LİSESİ",null,null,null,null,null,null,null,null,null,null,null,null,null,"Düzenleyen",null,null,null,null,null,"YASİN CEPECİ",null,null,null,null,null,null,null,null,null,"SGK VE İŞSİZLİK KESENEK ORANLARI"]
[null,"Kurum Vergi No",null,null,null,null,null,null,null,null,9280437145,null,null,null,null,null,null,null,null,null,null,null,null,null,"Ünvanı",null,null,null,null,null,"MÜDÜR YARD.",null,null,null,null,null,null,null,null,null,"SGK İşveren Payı %",null,null,null,null,null,null,null,null,null,null,null,null,20.5]
[null,"Kurum Vergi Dairesi",null,null,null,null,null,null,null,null,"YAHYALI VERGİ DAİRESİ",null,null,null,null,null,null,null,null,null,null,null,null,null,null,null,null,null,null,null,null,null,null,null,null,null,null,null,null,null,"SGK İşçi Payı %",null,null,null,null,null,null,null,null,null,null,null,null,14]
[null,"Banka  Adı ve Şubesi",null,null,null,null,null,null,null,null,"T.VAKIFLAR BANKASI -YAHYALI  ŞUBESİ",null,null,null,null,null,null,null,null,null,null,null,null,null,"Kontrol Eden"]
[null,"Banka Hesap No",null,null,null,null,null,null,null,null,null,null,null,null,null,null,null,null,null,null,null,null,null,null,"Ünvanı",null,null,null,null,null,null,null,null,null,null,null,null,null,null,null,"SGK Kesenek %'si Toplamı",null,null,null,null,null,null,null,null,null,null,null,null,{"$f":"SUM(BB13:BC15)","v":34.5}]
[null,"Banka Hesap İban No:",null,null,null,null,null,null,null,null,"TR870001500158007302407181"]
[null,"Kurum Adresi ",null,null,null,null,null,null,null,null,"SEYDİLİ MAH KARACATEPE MEVKİİ NO:15 YAHYALI ",null,null,null,null,null,null,null,null,null,null,null,null,null,"Gerçekleştirme Görevlisi",null,null,null,null,null,null,"MUSTAFA YILMAZ",null,null,null,null,null,null,null,null,"SAKATLIK İNDİRİM ORANLARI (GVK Tebliği 284)"]
[null,null,null,null,null,null,null,null,null,null,null,null,null,null,null,null,null,null,null,null,null,null,null,null,"Ünvanı",null,null,null,null,null,null,"OKUL MÜDÜRÜ",null,null,null,null,null,null,null,null,"I. Der. Sakatlar (Çalışma Gücünün Asgari % 80'ini Kay.) ",null,null,null,null,null,null,null,null,null,null,null,null,800]
[null,"Kurum Adres İlçesi ",null,null,null,null,null,null,null,null,"YAHYALI ",null,null,null,null,null,null,null,null,null,null,null,null,null,null,null,null,null,null,null,null,null,null,null,null,null,null,null,null,null,"II. Der. Sakatlar (Çalışma Gücünün Asgari % 60'ını Kay.) ",null,null,null,null,null,null,null,null,null,null,null,null,400]
[null,"Kurumun Adres İli ",null,null,null,null,null,null,null,null,"KAYSERİ",null,null,null,null,null,null,null,null,null,null,null,null,null,"Gerçekleştirme Görevlisi",null,null,null,null,null,null,"MUSTAFA YILMAZ",null,null,null,null,null,null,null,null,"III. Der. Sakatlar (Çalışma Gücünün Asgari % 40'ını Kay.) ",null,null,null,null,null,null,null,null,null,null,null,null,190]
[null,"Kurum Posta Kodu",null,null,null,null,null,null,null,null,38500,null,null,null,null,null,null,null,null,null,null,null,null,null,"Ünvanı",null,null,null,null,null,null,"OKUL MÜDÜRÜ"]
[]
[null,"Kurumun e-Mail Adresi",null,null,null,null,null,null,null,null,"758366@meb.k12.tr",null,null,null,null,null,null,null,null,null,null,null,null,null,"Harcama Yetkilisi ",null,null,null,null,null,"AHMET KAFALI"]
[null,"Kurum Telefon No",null,null,null,null,null,null,null,null,"0 352 6113959",null,null,null,null,null,null,null,null,null,null,null,null,null,"Ünvanı",null,null,null,null,null,"MİLLİ EĞİTİM MÜDÜRÜ"]
[null,"Kurum Fax No",null,null,null,null,null,null,null,null,"0 352 6113959"]
[]
[null,"E BİLDİRGEYE DAİR DİKKAT ÖNEMLİ UYARI"]
[null,"1. Ayda yapılan ekders ücret ödemesine ait SGK e-Bildirge bildirimi takip eden ayın 23'ne kadar verilmesi gerekir."]
[null,"2. Ayda yapılan ekders ücret ödemesine ait SGK e-Bildirge bildirimi takip eden ayın 23'ne kadar verilmesi gerekir."]
[null,"3. Ayda yapılan ekders ücret ödemesine ait SGK e-Bildirge bildirimi takip eden ayın 23'ne kadar verilmesi gerekir."]
[null,"4. Ayda yapılan ekders ücret ödemesine ait SGK e-Bildirge bildirimi takip eden ayın 23'ne kadar verilmesi gerekir."]
[null,"5. Ayda yapılan ekders ücret ödemesine ait SGK e-Bildirge bildirimi takip eden ayın 23'ne kadar verilmesi gerekir."]
[null,"6. Ayda yapılan ekders ücret ödemesine ait SGK e-Bildirge bildirimi takip eden ayın 23'ne kadar verilmesi gerekir."]
[null,"7. Ayda yapılan ekders ücret ödemesine ait SGK e-Bildirge bildirimi takip eden ayın 23'ne kadar verilmesi gerekir."]
[null,"8. Ayda yapılan ekders ücret ödemesine ait SGK e-Bildirge bildirimi takip eden ayın 23'ne kadar verilmesi gerekir."]
[null,"9. Ayda yapılan ekders ücret ödemesine ait SGK e-Bildirge bildirimi takip eden ayın 23'ne kadar verilmesi gerekir."]
[null,"10. Ayda yapılan ekders ücret ödemesine ait SGK e-Bildirge bildirimi takip eden ayın 23'ne kadar verilmesi gerekir."]
[null,"11. Ayda yapılan ekders ücret ödemesine ait SGK e-Bildirge bildirimi takip eden ayın 23'ne kadar verilmesi gerekir."]
[null,"12. Ayda yapılan ekders ücret ödemesine ait SGK e-Bildirge bildirimi takip eden ayın 23'ne kadar verilmesi gerekir."]

{"sheet":"Ekders Puantaj","index":1,"n_rows":34,"n_cols":41,"rows_kept":34,"cut":false,"hidden":false,"merged":[[31,29,31,37],[32,29,32,37],[0,1,0,40],[26,32,26,37],[30,29,30,32],[4,38,4,40],[3,39,3,40],[4,6,6,6],[4,1,6,1],[4,2,6,2],[4,3,6,3],[4,4,6,4],[4,5,6,5],[3,1,3,3]]}
[1,"AYLIK EKDERS ÜCRET PUANTAJ ÇİZELGESİ"]
[1]
[null,{"$f":"\"Kurumu Adı  : \"&Kur.Bil.!K12","v":"Kurumu Adı  : YAHYALI ÇOK PROGRAMLI ANADOLU LİSESİ"}]
[null,{"$f":"\"Bütçe Dönemi : \"&Kur.Bil.!R8","v":"Bütçe Dönemi : EKİM"},null,null,"EKİM",null,null,null,null,null,null,null,null,null,null,null,null,null,null,null,null,null,null,null,null,null,null,null,null,null,null,null,null,null,null,null,null,"Maaş Dönemi İlk Gününü Giriniz.",null,"2018-10-01"]
[1,"Sıra No ","TC Kimlik No","Adı Soyadı","Unvan","İşe Giriş Tarihi","Ekders %'si (Seç)",{"$f":"IF(H6=1,\"PAZARTESİ\",IF(H6=2,\"SALI\",IF(H6=3,\"ÇARŞAMBA\",IF(H6=4,\"PERŞEMBE\",IF(H6=5,\"CUMA\",IF(H6=6,\"CUMARTESİ\",IF(H6=7,\"PAZAR\",\"\")))))))","v":"PAZARTESİ"},"SALI","ÇARŞAMBA","PERŞEMBE","CUMA","CUMARTESİ","PAZAR","PAZARTESİ","SALI","ÇARŞAMBA","PERŞEMBE","CUMA","CUMARTESİ","PAZAR","PAZARTESİ","SALI","ÇARŞAMBA","PERŞEMBE","CUMA","CUMARTESİ","PAZAR","PAZARTESİ","SALI","ÇARŞAMBA","PERŞEMBE","CUMA","CUMARTESİ","PAZAR","PAZARTESİ","SALI","ÇARŞAMBA","EKDERS ÜCRET SAAT TOPLAMI"]
[1,null,null,null,null,null,null,{"$f":"WEEKDAY(H7,2)","v":1},{"$f":"WEEKDAY(I7,2)","v":2},3,4,5,6,7,1,2,3,4,5,6,7,1,2,3,4,5,6,7,1,2,3,4,5,6,7,1,2,3]
[1,null,null,null,null,null,null,{"$f":"AN4","v":"2018-10-01"},{"$f":"H7+1","v":"2018-10-02"},{"$f":"I7+1","v":"2018-10-03"},{"$f":"J7+1","v":"2018-10-04"},"2018-10-05","2018-10-06","2018-10-07","2018-10-08","2018-10-09","2018-10-10","2018-10-11","2018-10-12","2018-10-13","2018-10-14","2018-10-15","2018-10-16",{"$f":"W7+1","v":"2018-10-17"},"2018-10-18",{"$f":"Y7+1","v":"2018-10-19"},"2018-10-20","2018-10-21","2018-10-22","2018-10-23","2018-10-24","2018-10-25","2018-10-26","2018-10-27",{"$f":"AH7+1","v":"2018-10-28"},"2018-10-29","2018-10-30","2018-10-31","(%140 Göst.)","(%140 Göst. x %25 Fazlası)","(%150 Göst.)"]
[{"$f":"IF(D8=\"\",\"\",\"e\")","v":"e"},1,{"$f":"VLOOKUP(B8,'Pers. Bil.'!$A$5:$U$64,2,0)","v":29867025728},{"$f":"VLOOKUP(B8,'Pers. Bil.'!$A$5:$U$64,3,0)","v":"AHMET TOLGA ÇOBAN"},{"$f":"VLOOKUP(B8,'Pers. Bil.'!$A$5:$U$64,4,0)","v":"Ücretli Öğret."},"2018-09-17","%140 Göst.",null,null,null,null,null,null,null,null,null,null,null,null,null,null,null,null,null,null,null,null,null,null,null,null,null,null,null,null,null,null,null,{"$f":"SUM(H8:AL8)","v":0},{"$f":"IF(G8=\"%140 Göst. X %+25 Fazlası\",SUM(H8:AL8),0)","v":0},{"$f":"IF(G8=\"%150 Göst.\",SUM(H8:AL8),0)","v":0}]
["e",2,{"$f":"VLOOKUP(B9,'Pers. Bil.'!$A$5:$U$64,2,0)","v":28778061818},{"$f":"VLOOKUP(B9,'Pers. Bil.'!$A$5:$U$64,3,0)","v":"FATMA NUR CİĞER"},{"$f":"VLOOKUP(B9,'Pers. Bil.'!$A$5:$U$64,4,0)","v":"Ücretli Öğret."},"2018-09-17","%140 Göst.",null,null,null,null,null,null,null,null,null,null,null,null,null,null,null,null,null,null,null,null,null,null,null,null,null,null,null,null,null,null,null,{"$f":"SUM(H9:AL9)","v":0},0,0]
["e",3,{"$f":"VLOOKUP(B10,'Pers. Bil.'!$A$5:$U$64,2,0)","v":28481071876},{"$f":"VLOOKUP(B10,'Pers. Bil.'!$A$5:$U$64,3,0)","v":"ZELİHA OKUMUŞ"},{"$f":"VLOOKUP(B10,'Pers. Bil.'!$A$5:$U$64,4,0)","v":"Ücretli Öğret."},"2018-09-18","%140 Göst.",null,null,null,null,null,null,null,null,null,null,null,null,null,null,null,null,null,null,null,null,null,null,null,null,null,null,null,null,null,null,null,0,0,0]
["e",5,{"$f":"VLOOKUP(B11,'Pers. Bil.'!$A$5:$U$64,2,0)","v":49891358388},{"$f":"VLOOKUP(B11,'Pers. Bil.'!$A$5:$U$64,3,0)","v":"MUKADDES TABAK"},{"$f":"VLOOKUP(B11,'Pers. Bil.'!$A$5:$U$64,4,0)","v":"Ücretli Öğret."},"2018-09-20","%140 Göst.",null,null,null,null,null,null,null,null,null,null,null,null,null,null,null,null,null,null,null,null,null,null,null,null,null,null,null,null,null,null,null,0,0,0]
["e",6,{"$f":"VLOOKUP(B12,'Pers. Bil.'!$A$5:$U$64,2,0)","v":49462372478},{"$f":"VLOOKUP(B12,'Pers. Bil.'!$A$5:$U$64,3,0)","v":"VİLDAN GEYİK"},{"$f":"VLOOKUP(B12,'Pers. Bil.'!$A$5:$U$64,4,0)","v":"Ücretli Öğret."},"2018-09-24","%140 Göst.",4,6,null,null,null,null,null,4,6,null,null,null,null,null,null,null,null,null,null,null,null,null,null,null,null,null,null,null,null,null,null,20,0,0]
["e",7,{"$f":"VLOOKUP(B13,'Pers. Bil.'!$A$5:$U$64,2,0)","v":0},{"$f":"VLOOKUP(B13,'Pers. Bil.'!$A$5:$U$64,3,0)","v":0},{"$f":"VLOOKUP(B13,'Pers. Bil.'!$A$5:$U$64,4,0)","v":0},{"$f":"VLOOKUP(B13,'Pers. Bil.'!$A$5:$U$64,6,0)","v":"00:00:00"},null,null,null,null,null,null,null,null,null,null,null,null,null,null,null,null,null,null,null,null,null,null,null,null,null,null,null,null,null,null,null,null,0,0,0]
["e",8,{"$f":"VLOOKUP(B14,'Pers. Bil.'!$A$5:$U$64,2,0)","v":0},{"$f":"VLOOKUP(B14,'Pers. Bil.'!$A$5:$U$64,3,0)","v":0},{"$f":"VLOOKUP(B14,'Pers. Bil.'!$A$5:$U$64,4,0)","v":0},{"$f":"VLOOKUP(B14,'Pers. Bil.'!$A$5:$U$64,6,0)","v":"00:00:00"},null,null,null,null,null,null,null,null,null,null,null,null,null,null,null,null,null,null,null,null,null,null,null,null,null,null,null,null,null,null,null,null,0,0,0]
["e",9,{"$f":"VLOOKUP(B15,'Pers. Bil.'!$A$5:$U$64,2,0)","v":0},{"$f":"VLOOKUP(B15,'Pers. Bil.'!$A$5:$U$64,3,0)","v":0},{"$f":"VLOOKUP(B15,'Pers. Bil.'!$A$5:$U$64,4,0)","v":0},{"$f":"VLOOKUP(B15,'Pers. Bil.'!$A$5:$U$64,6,0)","v":"00:00:00"},null,null,null,null,null,null,null,null,null,null,null,null,null,null,null,null,null,null,null,null,null,null,null,null,null,null,null,null,null,null,null,null,0,0,0]
["e",10,{"$f":"VLOOKUP(B16,'Pers. Bil.'!$A$5:$U$64,2,0)","v":0},{"$f":"VLOOKUP(B16,'Pers. Bil.'!$A$5:$U$64,3,0)","v":0},{"$f":"VLOOKUP(B16,'Pers. Bil.'!$A$5:$U$64,4,0)","v":0},{"$f":"VLOOKUP(B16,'Pers. Bil.'!$A$5:$U$64,6,0)","v":"00:00:00"},null,null,null,null,null,null,null,null,null,null,null,null,null,null,null,null,null,null,null,null,null,null,null,null,null,null,null,null,null,null,null,null,0,0,0]
["e",11,{"$f":"VLOOKUP(B17,'Pers. Bil.'!$A$5:$U$64,2,0)","v":0},{"$f":"VLOOKUP(B17,'Pers. Bil.'!$A$5:$U$64,3,0)","v":0},{"$f":"VLOOKUP(B17,'Pers. Bil.'!$A$5:$U$64,4,0)","v":0},{"$f":"VLOOKUP(B17,'Pers. Bil.'!$A$5:$U$64,6,0)","v":"00:00:00"},null,null,null,null,null,null,null,null,null,null,null,null,null,null,null,null,null,null,null,null,null,null,null,null,null,null,null,null,null,null,null,null,0,0,0]
["e",12,{"$f":"VLOOKUP(B18,'Pers. Bil.'!$A$5:$U$64,2,0)","v":0},{"$f":"VLOOKUP(B18,'Pers. Bil.'!$A$5:$U$64,3,0)","v":0},{"$f":"VLOOKUP(B18,'Pers. Bil.'!$A$5:$U$64,4,0)","v":0},{"$f":"VLOOKUP(B18,'Pers. Bil.'!$A$5:$U$64,6,0)","v":"00:00:00"},null,null,null,null,null,null,null,null,null,null,null,null,null,null,null,null,null,null,null,null,null,null,null,null,null,null,null,null,null,null,null,null,0,0,0]
["e",13,{"$f":"VLOOKUP(B19,'Pers. Bil.'!$A$5:$U$64,2,0)","v":0},{"$f":"VLOOKUP(B19,'Pers. Bil.'!$A$5:$U$64,3,0)","v":0},{"$f":"VLOOKUP(B19,'Pers. Bil.'!$A$5:$U$64,4,0)","v":0},{"$f":"VLOOKUP(B19,'Pers. Bil.'!$A$5:$U$64,6,0)","v":"00:00:00"},null,null,null,null,null,null,null,null,null,null,null,null,null,null,null,null,null,null,null,null,null,null,null,null,null,null,null,null,null,null,null,null,0,0,0]
["e",14,{"$f":"VLOOKUP(B20,'Pers. Bil.'!$A$5:$U$64,2,0)","v":0},{"$f":"VLOOKUP(B20,'Pers. Bil.'!$A$5:$U$64,3,0)","v":0},{"$f":"VLOOKUP(B20,'Pers. Bil.'!$A$5:$U$64,4,0)","v":0},{"$f":"VLOOKUP(B20,'Pers. Bil.'!$A$5:$U$64,6,0)","v":"00:00:00"},null,null,null,null,null,null,null,null,null,null,null,null,null,null,null,null,null,null,null,null,null,null,null,null,null,null,null,null,null,null,null,null,0,0,0]
["e",15,{"$f":"VLOOKUP(B21,'Pers. Bil.'!$A$5:$U$64,2,0)","v":0},{"$f":"VLOOKUP(B21,'Pers. Bil.'!$A$5:$U$64,3,0)","v":0},{"$f":"VLOOKUP(B21,'Pers. Bil.'!$A$5:$U$64,4,0)","v":0},{"$f":"VLOOKUP(B21,'Pers. Bil.'!$A$5:$U$64,6,0)","v":"00:00:00"},null,null,null,null,null,null,null,null,null,null,null,null,null,null,null,null,null,null,null,null,null,null,null,null,null,null,null,null,null,null,null,null,0,0,0]
[null,16,{"$f":"VLOOKUP(B22,'Pers. Bil.'!$A$5:$U$64,2,0)","v":0},{"$f":"VLOOKUP(B22,'Pers. Bil.'!$A$5:$U$64,3,0)","v":0},{"$f":"VLOOKUP(B22,'Pers. Bil.'!$A$5:$U$64,4,0)","v":0},{"$f":"VLOOKUP(B22,'Pers. Bil.'!$A$5:$U$64,6,0)","v":"00:00:00"},null,null,null,null,null,null,null,null,null,null,null,null,null,null,null,null,null,null,null,null,null,null,null,null,null,null,null,null,null,null,null,null,0,0,0]
[null,17,{"$f":"VLOOKUP(B23,'Pers. Bil.'!$A$5:$U$64,2,0)","v":0},{"$f":"VLOOKUP(B23,'Pers. Bil.'!$A$5:$U$64,3,0)","v":0},{"$f":"VLOOKUP(B23,'Pers. Bil.'!$A$5:$U$64,4,0)","v":0},{"$f":"VLOOKUP(B23,'Pers. Bil.'!$A$5:$U$64,6,0)","v":"00:00:00"},null,null,null,null,null,null,null,null,null,null,null,null,null,null,null,null,null,null,null,null,null,null,null,null,null,null,null,null,null,null,null,null,0,0,0]
[null,18,{"$f":"VLOOKUP(B24,'Pers. Bil.'!$A$5:$U$64,2,0)","v":0},{"$f":"VLOOKUP(B24,'Pers. Bil.'!$A$5:$U$64,3,0)","v":0},{"$f":"VLOOKUP(B24,'Pers. Bil.'!$A$5:$U$64,4,0)","v":0},{"$f":"VLOOKUP(B24,'Pers. Bil.'!$A$5:$U$64,6,0)","v":"00:00:00"},null,null,null,null,null,null,null,null,null,null,null,null,null,null,null,null,null,null,null,null,null,null,null,null,null,null,null,null,null,null,null,null,0,0,0]
[null,19,{"$f":"VLOOKUP(B25,'Pers. Bil.'!$A$5:$U$64,2,0)","v":0},{"$f":"VLOOKUP(B25,'Pers. Bil.'!$A$5:$U$64,3,0)","v":0},{"$f":"VLOOKUP(B25,'Pers. Bil.'!$A$5:$U$64,4,0)","v":0},{"$f":"VLOOKUP(B25,'Pers. Bil.'!$A$5:$U$64,6,0)","v":"00:00:00"},null,null,null,null,null,null,null,null,null,null,null,null,null,null,null,null,null,null,null,null,null,null,null,null,null,null,null,null,null,null,null,null,0,0,0]
[null,20,{"$f":"VLOOKUP(B26,'Pers. Bil.'!$A$5:$U$64,2,0)","v":0},{"$f":"VLOOKUP(B26,'Pers. Bil.'!$A$5:$U$64,3,0)","v":0},{"$f":"VLOOKUP(B26,'Pers. Bil.'!$A$5:$U$64,4,0)","v":0},{"$f":"VLOOKUP(B26,'Pers. Bil.'!$A$5:$U$64,6,0)","v":"00:00:00"},null,null,null,null,null,null,null,null,null,null,null,null,null,null,null,null,null,null,null,null,null,null,null,null,null,null,null,null,null,null,null,null,0,0,0]
[null,null,null,null,null,null,null,null,null,null,null,null,null,null,null,null,null,null,null,null,null,null,null,null,null,null,null,null,null,null,null,null,"T O P L A M",null,null,null,null,null,{"$f":"SUM(AM8:AM26)","v":20},{"$f":"SUM(AN8:AN26)","v":0},0]
[null,null,{"$f":"\"Müdürlüğümüzde görev yapan ücretli öğretmenlerin \"&E4&\" ayı ekders ücret çizelgesidir.\"","v":"Müdürlüğümüzde görev yapan ücretli öğretmenlerin EKİM ayı ekders ücret çizelgesidir."}]
[]
[null,null,null,"Düzenleyen",null,null,null,null,null,null,null,null,null,null,null,null,null,null,null,null,null,null,null,null,null,null,null,null,null,"Gerçekleştirme Görevlisi"]
[null,null,null,{"$f":"TODAY()","v":"2018-10-09"},null,null,null,null,null,null,null,null,null,null,null,null,null,null,null,null,null,null,null,null,null,null,null,null,null,"2018-10-10"]
[null,null,"Adı Soyadı :","Yasin CEPECİ",null,null,null,null,null,null,null,null,null,null,null,null,null,null,null,null,null,null,null,null,null,null,null,null,"Adı Soyadı :","Kamil CENGİZ"]
[null,null,"Ünvanı       :","Müdür Yard.",null,null,null,null,null,null,null,null,null,null,null,null,null,null,null,null,null,null,null,null,null,null,null,null,"Ünvanı       :","Müdür Yrd."]
[null,null,"İmza          :",null,null,null,null,null,null,null,null,null,null,null,null,null,null,null,null,null,null,null,null,null,null,null,null,null,"İmza          :","……………………………………"]

{"sheet":"Pers. Bil.","index":2,"n_rows":24,"n_cols":83,"rows_kept":24,"cut":false,"hidden":false,"merged":[[2,28,3,28],[2,27,3,27],[2,30,3,30],[2,23,3,23],[2,31,3,31],[2,38,3,38],[2,39,3,39],[2,40,3,40],[2,41,3,41],[2,42,3,42],[2,32,3,32],[2,33,3,33],[2,24,3,24],[2,11,3,11],[1,82,3,82],[2,25,3,25],[2,34,3,34],[2,35,3,35],[2,36,3,36],[2,37,3,37],[2,26,3,26],[2,21,3,21],[2,44,2,46],[2,50,2,51],[2,29,3,29],[2,22,3,22],[2,8,3,8],[2,9,3,9],[2,17,3,17],[2,18,3,18],[2,19,3,19],[2,14,2,15],[2,10,3,10],[2,12,3,12],[2,13,3,13],[2,6,3,7],[2,0,3,0],[2,1,3,1],[2,2,3,2],[2,3,3,3],[2,4,3,5]]}
[1,2,3,4,5,6,7,8,9,10,11,12,13,14,15,16,17,18,19,20,21,22,23,24,25,26,27,28,29,30,31,32,33,34,35,36,37,38,39,40,41,42,43,44,45,46,47,48,49,50,51,52,53,54,55,56,57,58,59,60,61,62,63,64,65,66,67,68,69,70,71,72,73,74,75,76,77,78,79,80,81,82,83]
[null,null,null,"ÜCRETLİ ÖĞRETMEN BİLGİ GİRİŞİ",null,null,null,null,null,null,null,null,null,null,null,null,null,null,null,null,null,null,null,null,null,null,{"$f":"Kur.Bil.!AL8","v":0.11794},"Fiili Dönem Memur Maaş Katsayısı",null,null,null,null,null,null,null,null,null,null,null,null,"AGİ'ye Esas Asgari Ücret Tutarı",{"$f":"Kur.Bil.!AL9","v":2029.5},null,null,null,null,null,null,null,null,null,null,null,null,null,null,null,null,null,null,null,null,null,null,null,null,null,null,{"$f":"Kur.Bil.!R9","v":2018},null,1,2,3,4,5,6,7,8,9,10,11,12,"Yıllık Gelir Vergisi Matrah Toplamı"]
["Sıra No","T.C. Kimlik No","Adı ve Soyadı","Unvanı","İşe Başlama Tarihi",null,"İşe Ayrılma Tarihi",null,"Görev Yeri","Banka Şube Kodu","Banka Hesap No","İban No","İcra/Nafaka Dosya Açıklaması.","Varsa Sakatlık İndirim Tutarı","As. Geç. İnd. Bilgileri",null,null,"Ekders Saat Toplamı (%140 Göst.)","Ekders Saat Toplamı (%150 Göst.)","Ekders Saat Toplamı (%140 Göst.x%25 Fazlası)",null,"Sıra No","T.C. Kimlik No","Adı Soyadı","Unvanı","Ekders Saat Toplamı (%140 Göst.)","Ekders Saat Toplamı (%150 Göst.)","Ekders Saat Toplamı (%140 Göst.x%25 Fazlası)","TAHAKKUK TOPLAMI","SGK MATRAH TOPLAMI","SGK İşveren Payı (%20,5)","BRÜT TOPLAM","Süregelen Yıllık Gelir Vergisi Toplamı","Aylık Gelir Vergisi Matrah Toplamı","Gelir Vergisi Tutarı","Damga Vergisi Tutarı","SGK İşveren Payı (%20,5-%22,5)","SGK İşveren Payı (%14-%7,5)","İcra Kesinti Tutarı","Kesinti Toplamı","Ödeme Tutarı","As. Gec. İnd. Tutarı","Ele Geçen Tutarı",null,"Personelin",null,null,null,null,"Asgarî Ücret Brüt Tutar :",{"$f":"Kur.Bil.!AL9","v":2029.5},null,null,null,null,null,null,null,null,"Yararlanılan Asgari Geçimi İndirimi Tutarı (*****) ",null,null,null,null,null,null,null,null,"Daimi İşçinin",null,"Ocak","Şubat","Mart","Nisan","Mayıs","Haziran","Temmuz","Ağustos","Eylül","Ekim","Kasım","Aralık"]
[null,null,null,null,null,null,null,null,null,null,null,null,null,null,"Aile Durumu","Çıcuk Durumu",null,null,null,null,null,null,null,null,null,null,null,null,null,null,null,null,null,null,null,null,null,null,null,null,null,null,null,null,"Sıra No","Adı  Soyadı","Ünvanı","Medeni Hali","Çocuk Sayısı","AGİ Çal. ve Eş %'siİ","AGİ Çocuk %'si","Asgari Geçim İndirimi Oranı (%)","As. Geç. İnd. Esas Tutar","Aylık As. Geç. İnd. Tutarı [(3.sütun) X % 15] 12",1,2,3,4,5,6,7,8,9,10,11,12,null,"Sıra No","İşcinin Adı Soyadı"," Aylık Matrah ","Ay. Gelir Ver. Tutarı ","Ay. Gelir Ver. Tutarı ","Ay. Gelir Ver. Tutarı ","Ay. Gelir Ver. Tutarı ","Ay. Gelir Ver. Tutarı ","Ay. Gelir Ver. Tutarı ","Ay. Gelir Ver. Tutarı ","Ay. Gelir Ver. Tutarı ","Ay. Gelir Ver. Tutarı ","Ay. Gelir Ver. Tutarı ","Ay. Gelir Ver. Tutarı ","Ay. Gelir Ver. Tutarı "]
[1,29867025728,"AHMET TOLGA ÇOBAN","Ücretli Öğret.","2018-09-17",null,null,null,"ÇPL",158,null,null,0,null,"Bekar",0,null,{"$f":"'Ekders Puantaj'!AM8","v":0},{"$f":"'Ekders Puantaj'!AN9","v":0},{"$f":"'Ekders Puantaj'!AO10","v":0},null,{"$f":"A5","v":1},{"$f":"B5","v":29867025728},{"$f":"C5","v":"AHMET TOLGA ÇOBAN"},{"$f":"D5","v":"Ücretli Öğret."},{"$f":"R5","v":0},{"$f":"S5","v":0},{"$f":"T5","v":0},{"$f":"ROUND(Z5*($AA$2*140),2)+ROUND(AA5*($AA$2*150),2)+ROUND((AB5*($AA$2*140)*25/100)+(AB5*($AA$2*140)),2)","v":0},{"$f":"AC5","v":0},{"$f":"IF(Y5=\"Ücretli Öğret.\",ROUND(AD5*20.5/100,2),ROUND(AD5*22.5/100,2))","v":0},{"$f":"AC5+AE5","v":0},null,{"$f":"ROUND((AG5+AC5)-(N5+AL5),2)","v":0},{"$f":"ROUND(AH5*15/100,2)","v":0},{"$f":"ROUND(AC5*7.59/1000,2)","v":0},{"$f":"IF(Y5=\"Ücretli Öğret.\",ROUND(AD5*20.5/100,2),ROUND(AD5*22.5/100,2))","v":0},{"$f":"IF(Y5=\"Ücretli Öğret.\",ROUND(AD5*14/100,2),ROUND(AD5*7.5/100,2))","v":0},{"$f":"M5","v":0},{"$f":"AI5+AJ5+AK5+AL5+AM5","v":0},{"$f":"AF5-AN5","v":0},{"$f":"IF(AI5<BB5,AI5,BB5)","v":0},{"$f":"AO5+AP5","v":0},null,{"$f":"A5","v":1},{"$f":"C5","v":"AHMET TOLGA ÇOBAN"},{"$f":"D5","v":"Ücretli Öğret."},{"$f":"O5","v":"Bekar"},{"$f":"P5","v":0},{"$f":"IF(AV5=\"Bekar\",50,IF(AV5=\"Çalışıyor\",50,IF(AV5=\"Eşi Çalışmıyor\",60,0)))","v":50},{"$f":"IF(AW5=0,0,IF(AW5=1,7.5,IF(AW5=2,15,IF(AW5=3,20,IF(AW5=4,25)))))","v":0},{"$f":"AX5+AY5","v":50},{"$f":"ROUND(($AP$2*12)*AZ5/100,2)","v":12177},{"$f":"IF(AI5=0,0,ROUND((BA5*15/100)/12,2))","v":0},null,null,null,null,null,null,null,null,null,null,null,null,null,{"$f":"A5","v":1},{"$f":"C5","v":"AHMET TOLGA ÇOBAN"},null,{"$f":"AH5","v":0},null,null,null,null,null,null,null,null,null,null,null,{"$f":"SUM(BS5:CD5)","v":0}]
[2,28778061818,"FATMA NUR CİĞER","Ücretli Öğret.","2018-09-17",null,null,null,"ÇPL",158,null,null,null,null,"Bekar",0,null,{"$f":"'Ekders Puantaj'!AM9","v":0},null,null,null,{"$f":"A6","v":2},{"$f":"B6","v":28778061818},{"$f":"C6","v":"FATMA NUR CİĞER"},{"$f":"D6","v":"Ücretli Öğret."},{"$f":"R6","v":0},{"$f":"S6","v":0},{"$f":"T6","v":0},{"$f":"ROUND(Z6*($AA$2*140),2)+ROUND(AA6*($AA$2*150),2)+ROUND((AB6*($AA$2*140)*25/100)+(AB6*($AA$2*140)),2)","v":0},{"$f":"AC6","v":0},{"$f":"IF(Y6=\"Ücretli Öğret.\",ROUND(AD6*20.5/100,2),ROUND(AD6*22.5/100,2))","v":0},{"$f":"AC6+AE6","v":0},null,{"$f":"ROUND((AG6+AC6)-(N6+AL6),2)","v":0},{"$f":"ROUND(AH6*15/100,2)","v":0},{"$f":"ROUND(AC6*7.59/1000,2)","v":0},{"$f":"IF(Y6=\"Ücretli Öğret.\",ROUND(AD6*20.5/100,2),ROUND(AD6*22.5/100,2))","v":0},{"$f":"IF(Y6=\"Ücretli Öğret.\",ROUND(AD6*14/100,2),ROUND(AD6*7.5/100,2))","v":0},{"$f":"M6","v":0},{"$f":"AI6+AJ6+AK6+AL6+AM6","v":0},{"$f":"AF6-AN6","v":0},{"$f":"IF(AI6<BB6,AI6,BB6)","v":0},{"$f":"AO6+AP6","v":0},null,{"$f":"A6","v":2},{"$f":"C6","v":"FATMA NUR CİĞER"},{"$f":"D6","v":"Ücretli Öğret."},{"$f":"O6","v":"Bekar"},{"$f":"P6","v":0},{"$f":"IF(AV6=\"Bekar\",50,IF(AV6=\"Çalışıyor\",50,IF(AV6=\"Eşi Çalışmıyor\",60,0)))","v":50},{"$f":"IF(AW6=0,0,IF(AW6=1,7.5,IF(AW6=2,15,IF(AW6=3,20,IF(AW6=4,25)))))","v":0},{"$f":"AX6+AY6","v":50},{"$f":"ROUND(($AP$2*12)*AZ6/100,2)","v":12177},{"$f":"IF(AI6=0,0,ROUND((BA6*15/100)/12,2))","v":0},null,null,null,null,null,null,null,null,null,null,null,null,null,{"$f":"A6","v":2},{"$f":"C6","v":"FATMA NUR CİĞER"},null,{"$f":"AH6","v":0},null,null,null,null,null,null,null,null,null,null,null,0]
[3,28481071876,"ZELİHA OKUMUŞ","Ücretli Öğret.","2018-09-18",null,null,null,"ÇPL",158,null,null,null,null,"Bekar",null,null,{"$f":"'Ekders Puantaj'!AM10","v":0},null,null,null,3,28481071876,"ZELİHA OKUMUŞ","Ücretli Öğret.",0,0,0,0,0,0,0,null,0,0,0,0,0,0,0,0,0,0,null,3,"ZELİHA OKUMUŞ","Ücretli Öğret.","Bekar",0,50,0,50,12177,0,null,null,null,null,null,null,null,null,null,null,null,null,null,3,"ZELİHA OKUMUŞ",null,0,null,null,null,null,null,null,null,null,null,null,null,0]
[5,49891358388,"MUKADDES TABAK","Ücretli Öğret.","2018-09-20",null,null,null,"ÇPL",158,null,null,null,null,"Bekar",null,null,{"$f":"'Ekders Puantaj'!AM11","v":0},null,null,null,5,{"$f":"B8","v":49891358388},"MUKADDES TABAK","Ücretli Öğret.",{"$f":"R8","v":0},0,0,0,0,0,0,null,0,0,0,0,0,0,0,0,0,0,null,5,"MUKADDES TABAK","Ücretli Öğret.","Bekar",0,50,0,50,12177,0,null,null,null,null,null,null,null,null,null,null,null,null,null,5,"MUKADDES TABAK",null,null,null,null,null,null,null,null,null,null,null,null,null,0]
[6,49462372478,"VİLDAN GEYİK","Ücretli Öğret.","2018-09-24",null,null,null,null,null,null,null,null,null,"Bekar",null,null,{"$f":"'Ekders Puantaj'!AM12","v":20},null,null,null,6,49462372478,"VİLDAN GEYİK","Ücretli Öğret.",20,0,0,330.23,330.23,67.7,397.93,null,284,42.6,2.5099999999999998,67.7,46.23,0,159.04,238.89000000000001,42.6,281.49,null,6,"VİLDAN GEYİK","Ücretli Öğret.","Bekar",0,50,0,50,12177,152.21,null,null,null,null,null,null,null,null,null,null,null,null,null,6,"VİLDAN GEYİK",null,null,null,null,null,null,null,null,null,null,null,null,null,0]
[7,null,null,null,null,null,null,null,null,null,null,null,null,null,null,null,null,{"$f":"'Ekders Puantaj'!AM13","v":0},null,null,null,7,0,0,0,0,0,0,0,0,0,0,null,0,0,0,0,0,0,0,0,0,0,null,7,0,0,0,0,0,0,0,0,0,null,null,null,null,null,null,null,null,null,null,null,null,null,7,0,null,null,null,null,null,null,null,null,null,null,null,null,null,0]
[8,null,null,null,null,null,null,null,null,null,null,null,null,null,null,null,null,{"$f":"'Ekders Puantaj'!AM14","v":0},null,null,null,8,0,0,0,0,0,0,0,0,0,0,null,0,0,0,0,0,0,0,0,0,0,null,8,0,0,0,0,{"$f":"IF(AV11=\"Bekar\",50,IF(AV11=\"Eşi Çalışıyor\",50,IF(AV11=\"Eşi Çalışmıyor\",60,0)))","v":0},0,0,0,0,null,null,null,null,null,null,null,null,null,null,null,null,null,8,0,null,null,null,null,null,null,null,null,null,null,null,null,null,0]
[9,null,null,null,null,null,null,null,null,null,null,null,null,null,null,null,null,{"$f":"'Ekders Puantaj'!AM15","v":0},null,null,null,9,null,0,0,0,0,0,0,0,0,0,null,0,0,0,0,0,0,0,0,0,0,null,9,0,0,0,0,0,0,0,0,0,null,null,null,null,null,null,null,null,null,null,null,null,null,9,0,null,null,null,null,null,null,null,null,null,null,null,null,null,0]
[10,null,null,null,null,null,null,null,null,null,null,null,null,null,null,null,null,{"$f":"'Ekders Puantaj'!AM16","v":0},null,null,null,10,null,0,0,0,0,0,0,0,0,0,null,0,0,0,0,0,0,0,0,0,0,null,10,0,0,0,0,0,0,0,0,0,null,null,null,null,null,null,null,null,null,null,null,null,null,10,0,null,null,null,null,null,null,null,null,null,null,null,null,null,0]
[11,null,null,null,null,null,null,null,null,null,null,null,null,null,null,null,null,{"$f":"'Ekders Puantaj'!AM17","v":0},null,null,null,11,null,0,0,0,0,0,0,0,0,0,null,0,0,0,0,0,0,0,0,0,0,null,11,0,0,0,0,0,0,0,0,0,null,null,null,null,null,null,null,null,null,null,null,null,null,11,0,null,null,null,null,null,null,null,null,null,null,null,null,null,0]
[12,null,null,null,null,null,null,null,null,null,null,null,null,null,null,null,null,{"$f":"'Ekders Puantaj'!AM18","v":0},null,null,null,12,null,0,0,0,0,0,0,0,0,0,null,0,0,0,0,0,0,0,0,0,0,null,12,0,0,0,0,0,0,0,0,0,null,null,null,null,null,null,null,null,null,null,null,null,null,12,0,null,null,null,null,null,null,null,null,null,null,null,null,null,0]
[13,null,null,null,null,null,null,null,null,null,null,null,null,null,null,null,null,null,null,null,null,13,null,0,0,0,0,0,0,0,0,0,null,0,0,0,0,0,0,0,0,0,0,null,13,0,0,0,0,0,0,0,0,0,null,null,null,null,null,null,null,null,null,null,null,null,null,13,0,null,null,null,null,null,null,null,null,null,null,null,null,null,0]
[14,null,null,null,null,null,null,null,null,null,null,null,null,null,null,null,null,null,null,null,null,14,null,0,0,0,0,0,0,0,0,0,null,0,0,0,0,0,0,0,0,0,0,null,14,0,0,0,0,0,0,0,0,0,null,null,null,null,null,null,null,null,null,null,null,null,null,14,0,null,null,null,null,null,null,null,null,null,null,null,null,null,0]
[15,null,null,null,null,null,null,null,null,null,null,null,null,null,null,null,null,null,null,null,null,15,null,0,0,0,0,0,0,0,0,0,null,0,0,0,0,0,0,0,0,0,0,null,15,0,0,0,0,0,0,0,0,0,null,null,null,null,null,null,null,null,null,null,null,null,null,15,0,null,null,null,null,null,null,null,null,null,null,null,null,null,0]
[16,null,null,null,null,null,null,null,null,null,null,null,null,null,null,null,null,null,null,null,null,16,null,0,0,0,0,0,0,0,0,0,null,0,0,0,0,0,0,0,0,0,0,null,16,0,0,0,0,0,0,0,0,0,null,null,null,null,null,null,null,null,null,null,null,null,null,16,0,null,null,null,null,null,null,null,null,null,null,null,null,null,0]
[17,null,null,null,null,null,null,null,null,null,null,null,null,null,null,null,null,null,null,null,null,17,null,0,0,0,0,0,0,0,0,0,null,0,0,0,0,0,0,0,0,0,0,null,17,0,0,0,0,0,0,0,0,0,null,null,null,null,null,null,null,null,null,null,null,null,null,17,0,null,null,null,null,null,null,null,null,null,null,null,null,null,0]
[18,null,null,null,null,null,null,null,null,null,null,null,null,null,null,null,null,null,null,null,null,18,null,0,0,{"$f":"R21","v":0},0,0,0,0,0,0,null,0,0,0,0,0,0,0,0,0,0,null,18,0,0,0,0,0,0,0,0,0,null,null,null,null,null,null,null,null,null,null,null,null,null,18,0,null,null,null,null,null,null,null,null,null,null,null,null,null,0]
[19,null,null,null,null,null,null,null,null,null,null,null,null,null,null,null,null,null,null,null,null,19,null,0,0,0,0,0,0,0,0,0,null,0,0,0,0,0,0,0,0,0,0,null,19,0,0,0,0,0,0,0,0,0,null,null,null,null,null,null,null,null,null,null,null,null,null,19,0,null,null,null,null,null,null,null,null,null,null,null,null,null,0]
[20,null,null,null,null,null,null,null,null,null,null,null,null,null,null,null,null,null,null,null,null,20,null,0,0,0,0,0,0,0,0,0,null,0,0,0,0,0,0,0,0,0,0,null,20,0,0,0,0,0,0,0,0,0,null,null,null,null,null,null,null,null,null,null,null,null,null,20,0,null,null,null,null,null,null,null,null,null,null,null,null,null,0]
[null,null,null,null,null,null,null,null,null,null,null,null,null,null,null,null,null,null,null,null,null,null,null,"GENEL TOPLAM",null,{"$f":"SUM(Z5:Z23)","v":20},{"$f":"SUM(AA5:AA23)","v":0},{"$f":"SUM(AB5:AB23)","v":0},{"$f":"SUM(AC5:AC23)","v":330.23},{"$f":"SUM(AD5:AD23)","v":330.23},67.7,397.93,0,284,42.6,2.5099999999999998,67.7,46.23,0,159.04,238.89000000000001,42.6,281.49,null,null,null,null,"GENEL TOPLAM",0,250,0,250,60885,152.21]

{"sheet":"Bodro","index":3,"n_rows":41,"n_cols":32,"rows_kept":41,"cut":false,"hidden":false,"merged":[[7,28,7,29],[7,22,8,22],[7,15,8,15],[7,16,8,16],[7,17,8,17],[7,18,8,18],[7,19,8,19],[1,0,1,22],[7,5,8,5],[7,6,8,6],[7,7,8,7],[7,8,8,8],[7,9,8,9],[7,0,8,0],[7,1,8,1],[7,2,8,2],[7,3,8,3],[7,4,8,4],[7,14,8,14],[7,20,8,20],[7,21,8,21],[34,18,34,19],[35,18,35,19],[7,10,8,10],[7,11,8,11],[7,12,8,12],[7,13,8,13]]}
[1,2,3,4,null,null,null,29,34,35,37,38,41,42,43,44,45,46,49,52,53,54,56,57,58,59,60,61,62,63]
["ÜCRETLİ ÖĞRETMEN EKDERS ÜCRET BORDROSU"]
[]
["Dairesi",null,{"$f":"Kur.Bil.!K12","v":"YAHYALI ÇOK PROGRAMLI ANADOLU LİSESİ"},null,null,null,null,null,null,null,null,null,null,null,null,null,null,null,null,null,null,null,null,null,null,null,null,"ASGARİ GEÇİM İNDİRİM BODROSU"]
["İşyeri SGK Sicil No",null,{"$f":"Kur.Bil.!AT5","v":"185320101111655003810 -58000"},null,null,null,null,null,null,null,null,null,null,null,null,null,null,null,null,null,null,null,null,"ÖNEMLİ NOT:Asgari Geçim İndirim oranı en fazla %85 olup fazlası işleme alınmayacaktır."]
["Maaş Katsayısı:",null,{"$f":"Kur.Bil.!AL8","v":0.11794},null,null,null,null,null,null,null,null,null,null,null,null,null,null,null,null,null,{"$f":"\"Dönemi (Ay): \"&Kur.Bil.!R8","v":"Dönemi (Ay): EKİM"},"EKİM"]
["As. Geç. İnd. Tutarı:",null,{"$f":"Kur.Bil.!AL9","v":2029.5},null,null,null,null,null,null,null,null,null,null,null,null,null,null,null,null,null,{"$f":"\"Dönemi (Yıl): \"&Kur.Bil.!R9","v":"Dönemi (Yıl): 2018"}]
["Sıra No","T.C. Kimlik No","Adı Soyadı","Unvanı","Ekders Saat Toplamı (%140 Göst.)","Ekders Saat Toplamı (%150 Göst.)","Ekders Saat Toplamı (%140 Göst. x %25 Fazlası)","TAHAKKUK TOPLAMI","SGK MATRAH TOPLAMI","SGK İşveren Payı (%20,5)","BRÜT TOPLAM","Süregelen Yıllık Gelir Vergisi Toplamı","Aylık Gelir Vergisi Matrah Toplamı","Gelir Vergisi Tutarı","Damga Vergisi Tutarı","SGK İşveren Payı (%20,5-%22,5)","SGK İşveren Payı (%14-%7,5)","İcra Kesinti Tutarı","Kesinti Toplamı","Ödeme Tutarı","As. Gec. İnd. Tutarı","Ele Geçen Tutarı","Sıra No","Personelin",null,null,null,"Asgarî Ücret Brüt Tutar :",{"$f":"Kur.Bil.!AG10","v":0}]
[null,null,null,null,null,null,null,null,null,null,null,null,null,null,null,null,null,null,null,null,null,null,null,"Adı  Soyadı","Ünvanı","Medeni Hali","Çocuk Sayısı","AGİ Çal. ve Eş %'siİ","AGİ Çocuk %'si","Asgari Geçim İndirimi Oranı (%)","As. Geç. İnd. Esas Tutar","Aylık As. Geç. İnd. Tutarı [(3.sütun) X % 15] 12"]
[1,{"$f":"'Pers. Bil.'!W5","v":29867025728},{"$f":"'Pers. Bil.'!X5","v":"AHMET TOLGA ÇOBAN"},{"$f":"'Pers. Bil.'!Y5","v":"Ücretli Öğret."},{"$f":"'Pers. Bil.'!Z5","v":0},{"$f":"'Pers. Bil.'!AA5","v":0},{"$f":"'Pers. Bil.'!AB5","v":0},{"$f":"'Pers. Bil.'!AC5","v":0},{"$f":"'Pers. Bil.'!AD5","v":0},{"$f":"'Pers. Bil.'!AE5","v":0},{"$f":"'Pers. Bil.'!AF5","v":0},{"$f":"'Pers. Bil.'!AG5","v":0},{"$f":"'Pers. Bil.'!AH5","v":0},{"$f":"'Pers. Bil.'!AI5","v":0},{"$f":"'Pers. Bil.'!AJ5","v":0},{"$f":"'Pers. Bil.'!AK5","v":0},{"$f":"'Pers. Bil.'!AL5","v":0},{"$f":"'Pers. Bil.'!AM5","v":0},{"$f":"'Pers. Bil.'!AN5","v":0},{"$f":"'Pers. Bil.'!AO5","v":0},{"$f":"'Pers. Bil.'!AP5","v":0},{"$f":"'Pers. Bil.'!AQ5","v":0},{"$f":"A10","v":1},{"$f":"'Pers. Bil.'!AT5","v":"AHMET TOLGA ÇOBAN"},{"$f":"'Pers. Bil.'!AU5","v":"Ücretli Öğret."},{"$f":"'Pers. Bil.'!AV5","v":"Bekar"},{"$f":"'Pers. Bil.'!AW5","v":0},{"$f":"'Pers. Bil.'!AX5","v":50},{"$f":"'Pers. Bil.'!AY5","v":0},{"$f":"'Pers. Bil.'!AZ5","v":50},{"$f":"'Pers. Bil.'!BA5","v":12177},{"$f":"'Pers. Bil.'!BB5","v":0}]
[2,{"$f":"'Pers. Bil.'!W6","v":28778061818},{"$f":"'Pers. Bil.'!X6","v":"FATMA NUR CİĞER"},{"$f":"'Pers. Bil.'!Y6","v":"Ücretli Öğret."},{"$f":"'Pers. Bil.'!Z6","v":0},{"$f":"'Pers. Bil.'!AA6","v":0},{"$f":"'Pers. Bil.'!AB6","v":0},{"$f":"'Pers. Bil.'!AC6","v":0},{"$f":"'Pers. Bil.'!AD6","v":0},{"$f":"'Pers. Bil.'!AE6","v":0},{"$f":"'Pers. Bil.'!AF6","v":0},{"$f":"'Pers. Bil.'!AG6","v":0},{"$f":"'Pers. Bil.'!AH6","v":0},{"$f":"'Pers. Bil.'!AI6","v":0},{"$f":"'Pers. Bil.'!AJ6","v":0},{"$f":"'Pers. Bil.'!AK6","v":0},{"$f":"'Pers. Bil.'!AL6","v":0},{"$f":"'Pers. Bil.'!AM6","v":0},{"$f":"'Pers. Bil.'!AN6","v":0},{"$f":"'Pers. Bil.'!AO6","v":0},{"$f":"'Pers. Bil.'!AP6","v":0},{"$f":"'Pers. Bil.'!AQ6","v":0},{"$f":"A11","v":2},{"$f":"'Pers. Bil.'!AT6","v":"FATMA NUR CİĞER"},{"$f":"'Pers. Bil.'!AU6","v":"Ücretli Öğret."},{"$f":"'Pers. Bil.'!AV6","v":"Bekar"},{"$f":"'Pers. Bil.'!AW6","v":0},{"$f":"'Pers. Bil.'!AX6","v":50},{"$f":"'Pers. Bil.'!AY6","v":0},{"$f":"'Pers. Bil.'!AZ6","v":50},{"$f":"'Pers. Bil.'!BA6","v":12177},{"$f":"'Pers. Bil.'!BB6","v":0}]
[3,{"$f":"'Pers. Bil.'!W7","v":28481071876},{"$f":"'Pers. Bil.'!X7","v":"ZELİHA OKUMUŞ"},{"$f":"'Pers. Bil.'!Y7","v":"Ücretli Öğret."},{"$f":"'Pers. Bil.'!Z7","v":0},{"$f":"'Pers. Bil.'!AA7","v":0},{"$f":"'Pers. Bil.'!AB7","v":0},{"$f":"'Pers. Bil.'!AC7","v":0},{"$f":"'Pers. Bil.'!AD7","v":0},{"$f":"'Pers. Bil.'!AE7","v":0},{"$f":"'Pers. Bil.'!AF7","v":0},{"$f":"'Pers. Bil.'!AG7","v":0},{"$f":"'Pers. Bil.'!AH7","v":0},{"$f":"'Pers. Bil.'!AI7","v":0},{"$f":"'Pers. Bil.'!AJ7","v":0},{"$f":"'Pers. Bil.'!AK7","v":0},{"$f":"'Pers. Bil.'!AL7","v":0},{"$f":"'Pers. Bil.'!AM7","v":0},{"$f":"'Pers. Bil.'!AN7","v":0},{"$f":"'Pers. Bil.'!AO7","v":0},{"$f":"'Pers. Bil.'!AP7","v":0},{"$f":"'Pers. Bil.'!AQ7","v":0},3,{"$f":"'Pers. Bil.'!AT7","v":"ZELİHA OKUMUŞ"},{"$f":"'Pers. Bil.'!AU7","v":"Ücretli Öğret."},{"$f":"'Pers. Bil.'!AV7","v":"Bekar"},{"$f":"'Pers. Bil.'!AW7","v":0},{"$f":"'Pers. Bil.'!AX7","v":50},{"$f":"'Pers. Bil.'!AY7","v":0},{"$f":"'Pers. Bil.'!AZ7","v":50},{"$f":"'Pers. Bil.'!BA7","v":12177},{"$f":"'Pers. Bil.'!BB7","v":0}]
[5,{"$f":"'Pers. Bil.'!W8","v":49891358388},{"$f":"'Pers. Bil.'!X8","v":"MUKADDES TABAK"},{"$f":"'Pers. Bil.'!Y8","v":"Ücretli Öğret."},{"$f":"'Pers. Bil.'!Z8","v":0},{"$f":"'Pers. Bil.'!AA8","v":0},{"$f":"'Pers. Bil.'!AB8","v":0},{"$f":"'Pers. Bil.'!AC8","v":0},{"$f":"'Pers. Bil.'!AD8","v":0},{"$f":"'Pers. Bil.'!AE8","v":0},{"$f":"'Pers. Bil.'!AF8","v":0},{"$f":"'Pers. Bil.'!AG8","v":0},{"$f":"'Pers. Bil.'!AH8","v":0},{"$f":"'Pers. Bil.'!AI8","v":0},{"$f":"'Pers. Bil.'!AJ8","v":0},{"$f":"'Pers. Bil.'!AK8","v":0},{"$f":"'Pers. Bil.'!AL8","v":0},{"$f":"'Pers. Bil.'!AM8","v":0},{"$f":"'Pers. Bil.'!AN8","v":0},{"$f":"'Pers. Bil.'!AO8","v":0},{"$f":"'Pers. Bil.'!AP8","v":0},{"$f":"'Pers. Bil.'!AQ8","v":0},5,{"$f":"'Pers. Bil.'!AT8","v":"MUKADDES TABAK"},{"$f":"'Pers. Bil.'!AU8","v":"Ücretli Öğret."},{"$f":"'Pers. Bil.'!AV8","v":"Bekar"},{"$f":"'Pers. Bil.'!AW8","v":0},{"$f":"'Pers. Bil.'!AX8","v":50},{"$f":"'Pers. Bil.'!AY8","v":0},{"$f":"'Pers. Bil.'!AZ8","v":50},{"$f":"'Pers. Bil.'!BA8","v":12177},{"$f":"'Pers. Bil.'!BB8","v":0}]
[6,{"$f":"'Pers. Bil.'!W9","v":49462372478},{"$f":"'Pers. Bil.'!X9","v":"VİLDAN GEYİK"},{"$f":"'Pers. Bil.'!Y9","v":"Ücretli Öğret."},{"$f":"'Pers. Bil.'!Z9","v":20},{"$f":"'Pers. Bil.'!AA9","v":0},{"$f":"'Pers. Bil.'!AB9","v":0},{"$f":"'Pers. Bil.'!AC9","v":330.23},{"$f":"'Pers. Bil.'!AD9","v":330.23},{"$f":"'Pers. Bil.'!AE9","v":67.7},{"$f":"'Pers. Bil.'!AF9","v":397.93},{"$f":"'Pers. Bil.'!AG9","v":0},{"$f":"'Pers. Bil.'!AH9","v":284},{"$f":"'Pers. Bil.'!AI9","v":42.6},{"$f":"'Pers. Bil.'!AJ9","v":2.5099999999999998},{"$f":"'Pers. Bil.'!AK9","v":67.7},{"$f":"'Pers. Bil.'!AL9","v":46.23},{"$f":"'Pers. Bil.'!AM9","v":0},{"$f":"'Pers. Bil.'!AN9","v":159.04},{"$f":"'Pers. Bil.'!AO9","v":238.89000000000001},{"$f":"'Pers. Bil.'!AP9","v":42.6},{"$f":"'Pers. Bil.'!AQ9","v":281.49},6,{"$f":"'Pers. Bil.'!AT9","v":"VİLDAN GEYİK"},{"$f":"'Pers. Bil.'!AU9","v":"Ücretli Öğret."},{"$f":"'Pers. Bil.'!AV9","v":"Bekar"},{"$f":"'Pers. Bil.'!AW9","v":0},{"$f":"'Pers. Bil.'!AX9","v":50},{"$f":"'Pers. Bil.'!AY9","v":0},{"$f":"'Pers. Bil.'!AZ9","v":50},{"$f":"'Pers. Bil.'!BA9","v":12177},{"$f":"'Pers. Bil.'!BB9","v":152.21}]
[7,{"$f":"'Pers. Bil.'!W10","v":0},{"$f":"'Pers. Bil.'!X10","v":0},{"$f":"'Pers. Bil.'!Y10","v":0},{"$f":"'Pers. Bil.'!Z10","v":0},{"$f":"'Pers. Bil.'!AA10","v":0},{"$f":"'Pers. Bil.'!AB10","v":0},{"$f":"'Pers. Bil.'!AC10","v":0},{"$f":"'Pers. Bil.'!AD10","v":0},{"$f":"'Pers. Bil.'!AE10","v":0},{"$f":"'Pers. Bil.'!AF10","v":0},{"$f":"'Pers. Bil.'!AG10","v":0},{"$f":"'Pers. Bil.'!AH10","v":0},{"$f":"'Pers. Bil.'!AI10","v":0},{"$f":"'Pers. Bil.'!AJ10","v":0},{"$f":"'Pers. Bil.'!AK10","v":0},{"$f":"'Pers. Bil.'!AL10","v":0},{"$f":"'Pers. Bil.'!AM10","v":0},{"$f":"'Pers. Bil.'!AN10","v":0},{"$f":"'Pers. Bil.'!AO10","v":0},{"$f":"'Pers. Bil.'!AP10","v":0},{"$f":"'Pers. Bil.'!AQ10","v":0},7,{"$f":"'Pers. Bil.'!AT10","v":0},{"$f":"'Pers. Bil.'!AU10","v":0},{"$f":"'Pers. Bil.'!AV10","v":0},{"$f":"'Pers. Bil.'!AW10","v":0},{"$f":"'Pers. Bil.'!AX10","v":0},{"$f":"'Pers. Bil.'!AY10","v":0},{"$f":"'Pers. Bil.'!AZ10","v":0},{"$f":"'Pers. Bil.'!BA10","v":0},{"$f":"'Pers. Bil.'!BB10","v":0}]
[8,{"$f":"'Pers. Bil.'!W11","v":0},{"$f":"'Pers. Bil.'!X11","v":0},{"$f":"'Pers. Bil.'!Y11","v":0},{"$f":"'Pers. Bil.'!Z11","v":0},{"$f":"'Pers. Bil.'!AA11","v":0},{"$f":"'Pers. Bil.'!AB11","v":0},{"$f":"'Pers. Bil.'!AC11","v":0},{"$f":"'Pers. Bil.'!AD11","v":0},{"$f":"'Pers. Bil.'!AE11","v":0},{"$f":"'Pers. Bil.'!AF11","v":0},{"$f":"'Pers. Bil.'!AG11","v":0},{"$f":"'Pers. Bil.'!AH11","v":0},{"$f":"'Pers. Bil.'!AI11","v":0},{"$f":"'Pers. Bil.'!AJ11","v":0},{"$f":"'Pers. Bil.'!AK11","v":0},{"$f":"'Pers. Bil.'!AL11","v":0},{"$f":"'Pers. Bil.'!AM11","v":0},{"$f":"'Pers. Bil.'!AN11","v":0},{"$f":"'Pers. Bil.'!AO11","v":0},{"$f":"'Pers. Bil.'!AP11","v":0},{"$f":"'Pers. Bil.'!AQ11","v":0},8,{"$f":"'Pers. Bil.'!AT11","v":0},{"$f":"'Pers. Bil.'!AU11","v":0},{"$f":"'Pers. Bil.'!AV11","v":0},{"$f":"'Pers. Bil.'!AW11","v":0},{"$f":"'Pers. Bil.'!AX11","v":0},{"$f":"'Pers. Bil.'!AY11","v":0},{"$f":"'Pers. Bil.'!AZ11","v":0},{"$f":"'Pers. Bil.'!BA11","v":0},{"$f":"'Pers. Bil.'!BB11","v":0}]
[9,{"$f":"'Pers. Bil.'!W12","v":0},{"$f":"'Pers. Bil.'!X12","v":0},{"$f":"'Pers. Bil.'!Y12","v":0},{"$f":"'Pers. Bil.'!Z12","v":0},{"$f":"'Pers. Bil.'!AA12","v":0},{"$f":"'Pers. Bil.'!AB12","v":0},{"$f":"'Pers. Bil.'!AC12","v":0},{"$f":"'Pers. Bil.'!AD12","v":0},{"$f":"'Pers. Bil.'!AE12","v":0},{"$f":"'Pers. Bil.'!AF12","v":0},{"$f":"'Pers. Bil.'!AG12","v":0},{"$f":"'Pers. Bil.'!AH12","v":0},{"$f":"'Pers. Bil.'!AI12","v":0},{"$f":"'Pers. Bil.'!AJ12","v":0},{"$f":"'Pers. Bil.'!AK12","v":0},{"$f":"'Pers. Bil.'!AL12","v":0},{"$f":"'Pers. Bil.'!AM12","v":0},{"$f":"'Pers. Bil.'!AN12","v":0},{"$f":"'Pers. Bil.'!AO12","v":0},{"$f":"'Pers. Bil.'!AP12","v":0},{"$f":"'Pers. Bil.'!AQ12","v":0},9,{"$f":"'Pers. Bil.'!AT12","v":0},{"$f":"'Pers. Bil.'!AU12","v":0},{"$f":"'Pers. Bil.'!AV12","v":0},{"$f":"'Pers. Bil.'!AW12","v":0},{"$f":"'Pers. Bil.'!AX12","v":0},{"$f":"'Pers. Bil.'!AY12","v":0},{"$f":"'Pers. Bil.'!AZ12","v":0},{"$f":"'Pers. Bil.'!BA12","v":0},{"$f":"'Pers. Bil.'!BB12","v":0}]
[10,{"$f":"'Pers. Bil.'!W13","v":0},{"$f":"'Pers. Bil.'!X13","v":0},{"$f":"'Pers. Bil.'!Y13","v":0},{"$f":"'Pers. Bil.'!Z13","v":0},{"$f":"'Pers. Bil.'!AA13","v":0},{"$f":"'Pers. Bil.'!AB13","v":0},{"$f":"'Pers. Bil.'!AC13","v":0},{"$f":"'Pers. Bil.'!AD13","v":0},{"$f":"'Pers. Bil.'!AE13","v":0},{"$f":"'Pers. Bil.'!AF13","v":0},{"$f":"'Pers. Bil.'!AG13","v":0},{"$f":"'Pers. Bil.'!AH13","v":0},{"$f":"'Pers. Bil.'!AI13","v":0},{"$f":"'Pers. Bil.'!AJ13","v":0},{"$f":"'Pers. Bil.'!AK13","v":0},{"$f":"'Pers. Bil.'!AL13","v":0},{"$f":"'Pers. Bil.'!AM13","v":0},{"$f":"'Pers. Bil.'!AN13","v":0},{"$f":"'Pers. Bil.'!AO13","v":0},{"$f":"'Pers. Bil.'!AP13","v":0},{"$f":"'Pers. Bil.'!AQ13","v":0},10,{"$f":"'Pers. Bil.'!AT13","v":0},{"$f":"'Pers. Bil.'!AU13","v":0},{"$f":"'Pers. Bil.'!AV13","v":0},{"$f":"'Pers. Bil.'!AW13","v":0},{"$f":"'Pers. Bil.'!AX13","v":0},{"$f":"'Pers. Bil.'!AY13","v":0},{"$f":"'Pers. Bil.'!AZ13","v":0},{"$f":"'Pers. Bil.'!BA13","v":0},{"$f":"'Pers. Bil.'!BB13","v":0}]
[11,{"$f":"'Pers. Bil.'!W14","v":0},{"$f":"'Pers. Bil.'!X14","v":0},{"$f":"'Pers. Bil.'!Y14","v":0},{"$f":"'Pers. Bil.'!Z14","v":0},{"$f":"'Pers. Bil.'!AA14","v":0},{"$f":"'Pers. Bil.'!AB14","v":0},{"$f":"'Pers. Bil.'!AC14","v":0},{"$f":"'Pers. Bil.'!AD14","v":0},{"$f":"'Pers. Bil.'!AE14","v":0},{"$f":"'Pers. Bil.'!AF14","v":0},{"$f":"'Pers. Bil.'!AG14","v":0},{"$f":"'Pers. Bil.'!AH14","v":0},{"$f":"'Pers. Bil.'!AI14","v":0},{"$f":"'Pers. Bil.'!AJ14","v":0},{"$f":"'Pers. Bil.'!AK14","v":0},{"$f":"'Pers. Bil.'!AL14","v":0},{"$f":"'Pers. Bil.'!AM14","v":0},{"$f":"'Pers. Bil.'!AN14","v":0},{"$f":"'Pers. Bil.'!AO14","v":0},{"$f":"'Pers. Bil.'!AP14","v":0},{"$f":"'Pers. Bil.'!AQ14","v":0},11,{"$f":"'Pers. Bil.'!AT14","v":0},{"$f":"'Pers. Bil.'!AU14","v":0},{"$f":"'Pers. Bil.'!AV14","v":0},{"$f":"'Pers. Bil.'!AW14","v":0},{"$f":"'Pers. Bil.'!AX14","v":0},{"$f":"'Pers. Bil.'!AY14","v":0},{"$f":"'Pers. Bil.'!AZ14","v":0},{"$f":"'Pers. Bil.'!BA14","v":0},{"$f":"'Pers. Bil.'!BB14","v":0}]
[12,{"$f":"'Pers. Bil.'!W15","v":0},{"$f":"'Pers. Bil.'!X15","v":0},{"$f":"'Pers. Bil.'!Y15","v":0},{"$f":"'Pers. Bil.'!Z15","v":0},{"$f":"'Pers. Bil.'!AA15","v":0},{"$f":"'Pers. Bil.'!AB15","v":0},{"$f":"'Pers. Bil.'!AC15","v":0},{"$f":"'Pers. Bil.'!AD15","v":0},{"$f":"'Pers. Bil.'!AE15","v":0},{"$f":"'Pers. Bil.'!AF15","v":0},{"$f":"'Pers. Bil.'!AG15","v":0},{"$f":"'Pers. Bil.'!AH15","v":0},{"$f":"'Pers. Bil.'!AI15","v":0},{"$f":"'Pers. Bil.'!AJ15","v":0},{"$f":"'Pers. Bil.'!AK15","v":0},{"$f":"'Pers. Bil.'!AL15","v":0},{"$f":"'Pers. Bil.'!AM15","v":0},{"$f":"'Pers. Bil.'!AN15","v":0},{"$f":"'Pers. Bil.'!AO15","v":0},{"$f":"'Pers. Bil.'!AP15","v":0},{"$f":"'Pers. Bil.'!AQ15","v":0},12,{"$f":"'Pers. Bil.'!AT15","v":0},{"$f":"'Pers. Bil.'!AU15","v":0},{"$f":"'Pers. Bil.'!AV15","v":0},{"$f":"'Pers. Bil.'!AW15","v":0},{"$f":"'Pers. Bil.'!AX15","v":0},{"$f":"'Pers. Bil.'!AY15","v":0},{"$f":"'Pers. Bil.'!AZ15","v":0},{"$f":"'Pers. Bil.'!BA15","v":0},{"$f":"'Pers. Bil.'!BB15","v":0}]
[13,{"$f":"'Pers. Bil.'!W16","v":0},{"$f":"'Pers. Bil.'!X16","v":0},{"$f":"'Pers. Bil.'!Y16","v":0},{"$f":"'Pers. Bil.'!Z16","v":0},{"$f":"'Pers. Bil.'!AA16","v":0},{"$f":"'Pers. Bil.'!AB16","v":0},{"$f":"'Pers. Bil.'!AC16","v":0},{"$f":"'Pers. Bil.'!AD16","v":0},{"$f":"'Pers. Bil.'!AE16","v":0},{"$f":"'Pers. Bil.'!AF16","v":0},{"$f":"'Pers. Bil.'!AG16","v":0},{"$f":"'Pers. Bil.'!AH16","v":0},{"$f":"'Pers. Bil.'!AI16","v":0},{"$f":"'Pers. Bil.'!AJ16","v":0},{"$f":"'Pers. Bil.'!AK16","v":0},{"$f":"'Pers. Bil.'!AL16","v":0},{"$f":"'Pers. Bil.'!AM16","v":0},{"$f":"'Pers. Bil.'!AN16","v":0},{"$f":"'Pers. Bil.'!AO16","v":0},{"$f":"'Pers. Bil.'!AP16","v":0},{"$f":"'Pers. Bil.'!AQ16","v":0},13,{"$f":"'Pers. Bil.'!AT16","v":0},{"$f":"'Pers. Bil.'!AU16","v":0},{"$f":"'Pers. Bil.'!AV16","v":0},{"$f":"'Pers. Bil.'!AW16","v":0},{"$f":"'Pers. Bil.'!AX16","v":0},{"$f":"'Pers. Bil.'!AY16","v":0},{"$f":"'Pers. Bil.'!AZ16","v":0},{"$f":"'Pers. Bil.'!BA16","v":0},{"$f":"'Pers. Bil.'!BB16","v":0}]
[14,{"$f":"'Pers. Bil.'!W17","v":0},{"$f":"'Pers. Bil.'!X17","v":0},{"$f":"'Pers. Bil.'!Y17","v":0},{"$f":"'Pers. Bil.'!Z17","v":0},{"$f":"'Pers. Bil.'!AA17","v":0},{"$f":"'Pers. Bil.'!AB17","v":0},{"$f":"'Pers. Bil.'!AC17","v":0},{"$f":"'Pers. Bil.'!AD17","v":0},{"$f":"'Pers. Bil.'!AE17","v":0},{"$f":"'Pers. Bil.'!AF17","v":0},{"$f":"'Pers. Bil.'!AG17","v":0},{"$f":"'Pers. Bil.'!AH17","v":0},{"$f":"'Pers. Bil.'!AI17","v":0},{"$f":"'Pers. Bil.'!AJ17","v":0},{"$f":"'Pers. Bil.'!AK17","v":0},{"$f":"'Pers. Bil.'!AL17","v":0},{"$f":"'Pers. Bil.'!AM17","v":0},{"$f":"'Pers. Bil.'!AN17","v":0},{"$f":"'Pers. Bil.'!AO17","v":0},{"$f":"'Pers. Bil.'!AP17","v":0},{"$f":"'Pers. Bil.'!AQ17","v":0},14,{"$f":"'Pers. Bil.'!AT17","v":0},{"$f":"'Pers. Bil.'!AU17","v":0},{"$f":"'Pers. Bil.'!AV17","v":0},{"$f":"'Pers. Bil.'!AW17","v":0},{"$f":"'Pers. Bil.'!AX17","v":0},{"$f":"'Pers. Bil.'!AY17","v":0},{"$f":"'Pers. Bil.'!AZ17","v":0},{"$f":"'Pers. Bil.'!BA17","v":0},{"$f":"'Pers. Bil.'!BB17","v":0}]
[15,{"$f":"'Pers. Bil.'!W18","v":0},{"$f":"'Pers. Bil.'!X18","v":0},{"$f":"'Pers. Bil.'!Y18","v":0},{"$f":"'Pers. Bil.'!Z18","v":0},{"$f":"'Pers. Bil.'!AA18","v":0},{"$f":"'Pers. Bil.'!AB18","v":0},{"$f":"'Pers. Bil.'!AC18","v":0},{"$f":"'Pers. Bil.'!AD18","v":0},{"$f":"'Pers. Bil.'!AE18","v":0},{"$f":"'Pers. Bil.'!AF18","v":0},{"$f":"'Pers. Bil.'!AG18","v":0},{"$f":"'Pers. Bil.'!AH18","v":0},{"$f":"'Pers. Bil.'!AI18","v":0},{"$f":"'Pers. Bil.'!AJ18","v":0},{"$f":"'Pers. Bil.'!AK18","v":0},{"$f":"'Pers. Bil.'!AL18","v":0},{"$f":"'Pers. Bil.'!AM18","v":0},{"$f":"'Pers. Bil.'!AN18","v":0},{"$f":"'Pers. Bil.'!AO18","v":0},{"$f":"'Pers. Bil.'!AP18","v":0},{"$f":"'Pers. Bil.'!AQ18","v":0},15,{"$f":"'Pers. Bil.'!AT18","v":0},{"$f":"'Pers. Bil.'!AU18","v":0},{"$f":"'Pers. Bil.'!AV18","v":0},{"$f":"'Pers. Bil.'!AW18","v":0},{"$f":"'Pers. Bil.'!AX18","v":0},{"$f":"'Pers. Bil.'!AY18","v":0},{"$f":"'Pers. Bil.'!AZ18","v":0},{"$f":"'Pers. Bil.'!BA18","v":0},{"$f":"'Pers. Bil.'!BB18","v":0}]
[16,{"$f":"'Pers. Bil.'!W19","v":0},{"$f":"'Pers. Bil.'!X19","v":0},{"$f":"'Pers. Bil.'!Y19","v":0},{"$f":"'Pers. Bil.'!Z19","v":0},{"$f":"'Pers. Bil.'!AA19","v":0},{"$f":"'Pers. Bil.'!AB19","v":0},{"$f":"'Pers. Bil.'!AC19","v":0},{"$f":"'Pers. Bil.'!AD19","v":0},{"$f":"'Pers. Bil.'!AE19","v":0},{"$f":"'Pers. Bil.'!AF19","v":0},{"$f":"'Pers. Bil.'!AG19","v":0},{"$f":"'Pers. Bil.'!AH19","v":0},{"$f":"'Pers. Bil.'!AI19","v":0},{"$f":"'Pers. Bil.'!AJ19","v":0},{"$f":"'Pers. Bil.'!AK19","v":0},{"$f":"'Pers. Bil.'!AL19","v":0},{"$f":"'Pers. Bil.'!AM19","v":0},{"$f":"'Pers. Bil.'!AN19","v":0},{"$f":"'Pers. Bil.'!AO19","v":0},{"$f":"'Pers. Bil.'!AP19","v":0},{"$f":"'Pers. Bil.'!AQ19","v":0},16,{"$f":"'Pers. Bil.'!AT19","v":0},{"$f":"'Pers. Bil.'!AU19","v":0},{"$f":"'Pers. Bil.'!AV19","v":0},{"$f":"'Pers. Bil.'!AW19","v":0},{"$f":"'Pers. Bil.'!AX19","v":0},{"$f":"'Pers. Bil.'!AY19","v":0},{"$f":"'Pers. Bil.'!AZ19","v":0},{"$f":"'Pers. Bil.'!BA19","v":0},{"$f":"'Pers. Bil.'!BB19","v":0}]
[17,{"$f":"'Pers. Bil.'!W20","v":0},{"$f":"'Pers. Bil.'!X20","v":0},{"$f":"'Pers. Bil.'!Y20","v":0},{"$f":"'Pers. Bil.'!Z20","v":0},{"$f":"'Pers. Bil.'!AA20","v":0},{"$f":"'Pers. Bil.'!AB20","v":0},{"$f":"'Pers. Bil.'!AC20","v":0},{"$f":"'Pers. Bil.'!AD20","v":0},{"$f":"'Pers. Bil.'!AE20","v":0},{"$f":"'Pers. Bil.'!AF20","v":0},{"$f":"'Pers. Bil.'!AG20","v":0},{"$f":"'Pers. Bil.'!AH20","v":0},{"$f":"'Pers. Bil.'!AI20","v":0},{"$f":"'Pers. Bil.'!AJ20","v":0},{"$f":"'Pers. Bil.'!AK20","v":0},{"$f":"'Pers. Bil.'!AL20","v":0},{"$f":"'Pers. Bil.'!AM20","v":0},{"$f":"'Pers. Bil.'!AN20","v":0},{"$f":"'Pers. Bil.'!AO20","v":0},{"$f":"'Pers. Bil.'!AP20","v":0},{"$f":"'Pers. Bil.'!AQ20","v":0},17,{"$f":"'Pers. Bil.'!AT20","v":0},{"$f":"'Pers. Bil.'!AU20","v":0},{"$f":"'Pers. Bil.'!AV20","v":0},{"$f":"'Pers. Bil.'!AW20","v":0},{"$f":"'Pers. Bil.'!AX20","v":0},{"$f":"'Pers. Bil.'!AY20","v":0},{"$f":"'Pers. Bil.'!AZ20","v":0},{"$f":"'Pers. Bil.'!BA20","v":0},{"$f":"'Pers. Bil.'!BB20","v":0}]
[18,{"$f":"'Pers. Bil.'!W21","v":0},{"$f":"'Pers. Bil.'!X21","v":0},{"$f":"'Pers. Bil.'!Y21","v":0},{"$f":"'Pers. Bil.'!Z21","v":0},{"$f":"'Pers. Bil.'!AA21","v":0},{"$f":"'Pers. Bil.'!AB21","v":0},{"$f":"'Pers. Bil.'!AC21","v":0},{"$f":"'Pers. Bil.'!AD21","v":0},{"$f":"'Pers. Bil.'!AE21","v":0},{"$f":"'Pers. Bil.'!AF21","v":0},{"$f":"'Pers. Bil.'!AG21","v":0},{"$f":"'Pers. Bil.'!AH21","v":0},{"$f":"'Pers. Bil.'!AI21","v":0},{"$f":"'Pers. Bil.'!AJ21","v":0},{"$f":"'Pers. Bil.'!AK21","v":0},{"$f":"'Pers. Bil.'!AL21","v":0},{"$f":"'Pers. Bil.'!AM21","v":0},{"$f":"'Pers. Bil.'!AN21","v":0},{"$f":"'Pers. Bil.'!AO21","v":0},{"$f":"'Pers. Bil.'!AP21","v":0},{"$f":"'Pers. Bil.'!AQ21","v":0},18,{"$f":"'Pers. Bil.'!AT21","v":0},{"$f":"'Pers. Bil.'!AU21","v":0},{"$f":"'Pers. Bil.'!AV21","v":0},{"$f":"'Pers. Bil.'!AW21","v":0},{"$f":"'Pers. Bil.'!AX21","v":0},{"$f":"'Pers. Bil.'!AY21","v":0},{"$f":"'Pers. Bil.'!AZ21","v":0},{"$f":"'Pers. Bil.'!BA21","v":0},{"$f":"'Pers. Bil.'!BB21","v":0}]
[19,{"$f":"'Pers. Bil.'!W22","v":0},{"$f":"'Pers. Bil.'!X22","v":0},{"$f":"'Pers. Bil.'!Y22","v":0},{"$f":"'Pers. Bil.'!Z22","v":0},{"$f":"'Pers. Bil.'!AA22","v":0},{"$f":"'Pers. Bil.'!AB22","v":0},{"$f":"'Pers. Bil.'!AC22","v":0},{"$f":"'Pers. Bil.'!AD22","v":0},{"$f":"'Pers. Bil.'!AE22","v":0},{"$f":"'Pers. Bil.'!AF22","v":0},{"$f":"'Pers. Bil.'!AG22","v":0},{"$f":"'Pers. Bil.'!AH22","v":0},{"$f":"'Pers. Bil.'!AI22","v":0},{"$f":"'Pers. Bil.'!AJ22","v":0},{"$f":"'Pers. Bil.'!AK22","v":0},{"$f":"'Pers. Bil.'!AL22","v":0},{"$f":"'Pers. Bil.'!AM22","v":0},{"$f":"'Pers. Bil.'!AN22","v":0},{"$f":"'Pers. Bil.'!AO22","v":0},{"$f":"'Pers. Bil.'!AP22","v":0},{"$f":"'Pers. Bil.'!AQ22","v":0},19,{"$f":"'Pers. Bil.'!AT22","v":0},{"$f":"'Pers. Bil.'!AU22","v":0},{"$f":"'Pers. Bil.'!AV22","v":0},{"$f":"'Pers. Bil.'!AW22","v":0},{"$f":"'Pers. Bil.'!AX22","v":0},{"$f":"'Pers. Bil.'!AY22","v":0},{"$f":"'Pers. Bil.'!AZ22","v":0},{"$f":"'Pers. Bil.'!BA22","v":0},{"$f":"'Pers. Bil.'!BB22","v":0}]
[20,{"$f":"'Pers. Bil.'!W23","v":0},{"$f":"'Pers. Bil.'!X23","v":0},{"$f":"'Pers. Bil.'!Y23","v":0},{"$f":"'Pers. Bil.'!Z23","v":0},{"$f":"'Pers. Bil.'!AA23","v":0},{"$f":"'Pers. Bil.'!AB23","v":0},{"$f":"'Pers. Bil.'!AC23","v":0},{"$f":"'Pers. Bil.'!AD23","v":0},{"$f":"'Pers. Bil.'!AE23","v":0},{"$f":"'Pers. Bil.'!AF23","v":0},{"$f":"'Pers. Bil.'!AG23","v":0},{"$f":"'Pers. Bil.'!AH23","v":0},{"$f":"'Pers. Bil.'!AI23","v":0},{"$f":"'Pers. Bil.'!AJ23","v":0},{"$f":"'Pers. Bil.'!AK23","v":0},{"$f":"'Pers. Bil.'!AL23","v":0},{"$f":"'Pers. Bil.'!AM23","v":0},{"$f":"'Pers. Bil.'!AN23","v":0},{"$f":"'Pers. Bil.'!AO23","v":0},{"$f":"'Pers. Bil.'!AP23","v":0},{"$f":"'Pers. Bil.'!AQ23","v":0},20,{"$f":"'Pers. Bil.'!AT23","v":0},{"$f":"'Pers. Bil.'!AU23","v":0},{"$f":"'Pers. Bil.'!AV23","v":0},{"$f":"'Pers. Bil.'!AW23","v":0},{"$f":"'Pers. Bil.'!AX23","v":0},{"$f":"'Pers. Bil.'!AY23","v":0},{"$f":"'Pers. Bil.'!AZ23","v":0},{"$f":"'Pers. Bil.'!BA23","v":0},{"$f":"'Pers. Bil.'!BB23","v":0}]
[null,null,"GENEL TOPLAM",null,null,null,null,{"$f":"SUM(H10:H28)","v":330.23},330.23,67.7,397.93,0,284,42.6,2.5099999999999998,67.7,46.23,0,159.04,238.89000000000001,42.6,281.49,{"$f":"A29","v":0},{"$f":"SUM(X10:X28)","v":0},null,null,null,null,null,{"$f":"SUM(AD10:AD28)","v":250}]
[null,"Müdürlüğümüzde görevli ücretli öğretmenlerin ",null,"EKİM","ayı ekders ücreti bordrosudur."]
[]
[]
[null,null,"Düzenleyen",null,null,null,null,null,null,null,null,null,null,null,null,null,null,null,"Gerçekleştirme Görevlisi"]
[null,null,{"$f":"TODAY()","v":"2018-10-09"},null,null,null,null,null,null,null,null,null,null,null,null,null,null,null,{"$f":"TODAY()","v":"2018-10-09"}]
[null,"Adı Soyadı :","Yasin CEPECİ",null,null,null,null,null,null,null,null,null,null,null,null,null,null,"Adı Soyadı :","Yasin CEPECİ"]
[null,"Ünvanı       :","Müdür Yrd.",null,null,null,null,null,null,null,null,null,null,null,null,null,null,"Ünvanı       :","Müdür Yrd."]
[null,"İmza          :","……………………………………",null,null,null,null,null,null,null,null,null,null,null,null,null,null,"İmza          :","………………………………."]
[]
[]
[]
["M.Y.H.B.Y."]

{"sheet":"Kişi Bodrosu","index":4,"n_rows":31,"n_cols":5,"rows_kept":31,"cut":false,"hidden":false,"merged":[[22,0,24,4],[1,0,1,4],[7,0,7,1]]}
[]
["ÜCRETLİ ÖĞRETMEN EKDERS ÜCRET BORDROSU"]
[]
[]
[{"$f":"\"Kurum Adı: \"&Kur.Bil.!K12","v":"Kurum Adı: YAHYALI ÇOK PROGRAMLI ANADOLU LİSESİ"}]
[{"$f":"\"Dönemi (Ay): \"&Kur.Bil.!R8","v":"Dönemi (Ay): EKİM"}]
[{"$f":"\"Dönemi (Yıl): \"&Kur.Bil.!R9","v":"Dönemi (Yıl): 2018"}]
[]
["Sıra No",1,null,"Süregelen Yıllık Gelir Vergisi Toplamı",{"$f":"VLOOKUP($B$9,Bodro!$A$10:$AD$80,12,0)","v":0}]
["T.C. Kimlik No",{"$f":"VLOOKUP($B$9,Bodro!$A$10:$AD$80,2,0)","v":29867025728},null,"Aylık Gelir Vergisi Matrah Toplamı",{"$f":"VLOOKUP($B$9,Bodro!$A$10:$AD$80,13,0)","v":0}]
["Adı Soyadı",{"$f":"VLOOKUP($B$9,Bodro!$A$10:$AD$80,3,0)","v":"AHMET TOLGA ÇOBAN"},null,"Gelir Vergisi Tutarı",{"$f":"VLOOKUP($B$9,Bodro!$A$10:$AD$80,14,0)","v":0}]
["Unvanı",{"$f":"VLOOKUP($B$9,Bodro!$A$10:$AD$80,4,0)","v":"Ücretli Öğret."},null,"Damga Vergisi Tutarı",{"$f":"VLOOKUP($B$9,Bodro!$A$10:$AD$80,15,0)","v":0}]
["Ekders Saat Toplamı (%140 Göst.)",{"$f":"VLOOKUP($B$9,Bodro!$A$10:$AD$80,5,0)","v":0},null,"SGK İşveren Payı (%20,5-%22,5)",{"$f":"VLOOKUP($B$9,Bodro!$A$10:$AD$80,16,0)","v":0}]
["Ekders Saat Toplamı (%150 Göst.)",{"$f":"VLOOKUP($B$9,Bodro!$A$10:$AD$80,6,0)","v":0},null,"SGK İşveren Payı (%14-%7,5)",{"$f":"VLOOKUP($B$9,Bodro!$A$10:$AD$80,17,0)","v":0}]
["Ekders Saat Toplamı (%140 Göst. x %25 Fazlası)",{"$f":"VLOOKUP($B$9,Bodro!$A$10:$AD$80,7,0)","v":0},null,"İcra Kesinti Tutarı",{"$f":"VLOOKUP($B$9,Bodro!$A$10:$AD$80,18,0)","v":0}]
["TAHAKKUK TOPLAMI",{"$f":"VLOOKUP($B$9,Bodro!$A$10:$AD$80,8,0)","v":0},null,"Kesinti Toplamı",{"$f":"VLOOKUP($B$9,Bodro!$A$10:$AD$80,19,0)","v":0}]
["SGK MATRAH TOPLAMI",{"$f":"VLOOKUP($B$9,Bodro!$A$10:$AD$80,9,0)","v":0},null,"Ödeme Tutarı",{"$f":"VLOOKUP($B$9,Bodro!$A$10:$AD$80,20,0)","v":0}]
["SGK İşveren Payı (%20,5)",{"$f":"VLOOKUP($B$9,Bodro!$A$10:$AD$80,10,0)","v":0},null,"As. Gec. İnd. Tutarı",{"$f":"VLOOKUP($B$9,Bodro!$A$10:$AD$80,21,0)","v":0}]
["BRÜT TOPLAM",{"$f":"VLOOKUP($B$9,Bodro!$A$10:$AD$80,11,0)","v":0},null,"Ele Geçen Tutarı",{"$f":"VLOOKUP($B$9,Bodro!$A$10:$AD$80,22,0)","v":0}]
[]
[]
[]
["             Yukarıda kimlik bilgileri bulunan kişi Müdürlüğümüzde 2016.-2017 Eğitim öğretim döneminde ücretli öğretmen olarak görev yapmak üzere sözleşme yapılan personele ait iş bu \"Ücret Öğretmen Ekders Ücret Bodrosu\" personelin talebi üzerine düzenlenmiştir. Bu belgede silinti veya kazıntı olması durumunda Müdürlüğümüz kayıtları esasdır."]
[]
[]
[]
["Düzenleyen",null,null,null,"Gerçekleştirme Görevlisi"]
[{"$f":"TODAY()","v":"2018-10-09"},null,null,null,{"$f":"TODAY()","v":"2018-10-09"}]
["Adı ve Soyadı :OSMAN BAYER",null,null,null,"Adı Soyadı :AHMET OSMANCA"]
["Ünvanı       :MÜDÜR YRD.",null,null,null,"Ünvanı       :OKUL MÜDÜRÜ"]
["İmza          :………………………………",null,null,null,"İmza          :……………………………….."]

{"sheet":"XML Hes.","index":5,"n_rows":54,"n_cols":27,"rows_kept":54,"cut":false,"hidden":false,"merged":[[52,20,52,22],[4,1,4,2],[5,1,5,2],[51,20,51,21],[1,13,1,14],[2,13,2,14],[3,13,3,14],[4,13,4,14],[2,15,2,16],[3,15,3,16],[4,15,4,16],[1,15,1,16]]}
[null,null,null,null,null,null,null,"Bordro Tahakuk Bilgileri",null,null,null,null,null,"E-Bildirge Tahakuk Bilgileri"]
[null,null,null,null,null,null,"Açıklamalar","SGK Bordro PEK Tutarı",null,null,"PEK Toplamı",null,"Açıklamalar","PEK Tutarı",null,"Kesinti Tutarı"]
[null,null,null,null,null,null,"SGK Matrah Tutarı",{"$f":"'Pers. Bil.'!AD24","v":330.23},null,null,{"$f":"H3","v":330.23},null,"13 Nolu e-Bil. Tah. Tutarı"]
[null,null,null,null,null,null,"SGK İşveren Hissesi",{"$f":"Bodro!Q29","v":46.23},null,null,null,null,"05 Nolu e-Bil. Tah. Tutarı"]
[null,{"$f":"Bodro!I29","v":330.23},null,null,null,null,"SGK İşçi Pirim Hissesi",{"$f":"Bodro!R29","v":0},null,null,null,null,"GENEL TOPLAM",{"$f":"SUM(N3:N4)","v":0},null,{"$f":"SUM(P3:Q4)","v":0}]
[null,{"$f":"Bodro!Q29+Bodro!R29","v":46.23},null,"SGK Kesinti Toplamı",null,null,"GENEL TOPLAM"]
["UYARI; BU SAYFADAKİ BİLGİLER XML DOSYASININ HAZIRLANMASI İÇİN GEREKLİ BİLGİLERİ İÇERDİĞİNDEN İŞLEM YAPMAYINIZ."]
[null,null,null,null,null,null,null,null,null,null,"Prim","işe","işten","eksik","eksik","işten",null,"İstirahat",null,null,"BORDRO ÜCRET TUTARI","BODRO İKRAMİYE TUTARI","Tediye İkramiye","İkramiye Toplamı",null,"Maaş","İkramiye"]
["Sıra","Belge","Kanun","Sigortalı","SGNO (TC Kimlik)","Sigortalı Adı","Sigortalı Soyadı","Sigortalı","ÜCRET","İKRAMİYE","Öd.","giriş g.","çıkış g.","gün","gün","çıkış","Meslek","  Sürelerinde"]
["No","Türü","No(5hane)","Sicil Numarası","Numarası (11hane)",null,null,"İlkSoyadı","TL","TL","Günü","GGAA","GGAA","sayısı","nedeni","nedeni","Kod","Çalışmamıştır"]
[1,{"$f":"IF('Pers. Bil.'!D5=\"Ücretli Öğret.\",\"13\",\"05\")","v":"13"},{"$f":"IF(E11>0,\"00000\",\"\")","v":"00000"},null,{"$f":"IF('Pers. Bil.'!W5=\"\",0,'Pers. Bil.'!W5)","v":29867025728},{"$f":"IF(E11<0,0,LEFT(SUBSTITUTE('Pers. Bil.'!C5,\" \",\"*\",LEN('Pers. Bil.'!C5)-LEN(SUBSTITUTE('Pers. Bil.'!C5,\" \",\"\"))),FIND(\"*\",SUBSTITUTE('Pers. Bil.'!C5,\" \",\"*\",LEN('Pers. Bil.'!C5)-LEN(SUBSTITUTE('Pers. Bil.'!C5,\" \",\"\"))),1)-1))","v":"AHMET TOLGA"},{"$f":"IF(E11<0,0,MID('Pers. Bil.'!C5,LEN('XML Hes.'!F11)+2,LEN('Pers. Bil.'!C5)-LEN('XML Hes.'!F11)))","v":"ÇOBAN"},null,{"$f":"IF('Pers. Bil.'!W5=\"\",0,'Pers. Bil.'!AD5)","v":0},null,{"$f":"IF('Pers. Bil.'!Z5+'Pers. Bil.'!AA5+'Pers. Bil.'!AB5>0,('Pers. Bil.'!Z5+'Pers. Bil.'!AA5+'Pers. Bil.'!AB5)/7.5,0)","v":0},{"$f":"'Pers. Bil.'!F5","v":0},{"$f":"'Pers. Bil.'!H5","v":0},null,null,null,null,null,null,null,{"$f":"Bodro!#REF!-V11","v":{"$error":"#REF!"}},{"$f":"Bodro!#REF!+Bodro!#REF!","v":{"$error":"#REF!"}},944.19,{"$f":"V11+W11","v":{"$error":"#REF!"}},null,{"$f":"SUBSTITUTE(U11,\",\",\".\")","v":{"$error":"#REF!"}},{"$f":"SUBSTITUTE(X11,\",\",\".\")","v":{"$error":"#REF!"}}]
[2,{"$f":"IF('Pers. Bil.'!D6=\"Ücretli Öğret.\",\"13\",\"05\")","v":"13"},{"$f":"IF(E12>0,\"00000\",\"\")","v":"00000"},null,{"$f":"IF('Pers. Bil.'!W6=\"\",0,'Pers. Bil.'!W6)","v":28778061818},{"$f":"IF(E12<0,0,LEFT(SUBSTITUTE('Pers. Bil.'!C6,\" \",\"*\",LEN('Pers. Bil.'!C6)-LEN(SUBSTITUTE('Pers. Bil.'!C6,\" \",\"\"))),FIND(\"*\",SUBSTITUTE('Pers. Bil.'!C6,\" \",\"*\",LEN('Pers. Bil.'!C6)-LEN(SUBSTITUTE('Pers. Bil.'!C6,\" \",\"\"))),1)-1))","v":"FATMA NUR"},{"$f":"IF(E12<0,0,MID('Pers. Bil.'!C6,LEN('XML Hes.'!F12)+2,LEN('Pers. Bil.'!C6)-LEN('XML Hes.'!F12)))","v":"CİĞER"},null,{"$f":"'Pers. Bil.'!AD6","v":0},null,{"$f":"IF('Pers. Bil.'!Z6+'Pers. Bil.'!AA6+'Pers. Bil.'!AB6>0,('Pers. Bil.'!Z6+'Pers. Bil.'!AA6+'Pers. Bil.'!AB6)/7.5,0)","v":0},{"$f":"'Pers. Bil.'!F6","v":0},{"$f":"'Pers. Bil.'!H6","v":0},null,null,null,null,null,null,null,{"$f":"Bodro!#REF!-V12","v":{"$error":"#REF!"}},{"$f":"Bodro!#REF!+Bodro!#REF!","v":{"$error":"#REF!"}},983.32,{"$f":"V12+W12","v":{"$error":"#REF!"}},null,{"$f":"SUBSTITUTE(U12,\",\",\".\")","v":{"$error":"#REF!"}},{"$f":"SUBSTITUTE(X12,\",\",\".\")","v":{"$error":"#REF!"}}]
[3,{"$f":"IF('Pers. Bil.'!D7=\"Ücretli Öğret.\",\"13\",\"05\")","v":"13"},"00000",null,{"$f":"IF('Pers. Bil.'!W7=\"\",0,'Pers. Bil.'!W7)","v":28481071876},{"$f":"IF(E13<0,0,LEFT(SUBSTITUTE('Pers. Bil.'!C7,\" \",\"*\",LEN('Pers. Bil.'!C7)-LEN(SUBSTITUTE('Pers. Bil.'!C7,\" \",\"\"))),FIND(\"*\",SUBSTITUTE('Pers. Bil.'!C7,\" \",\"*\",LEN('Pers. Bil.'!C7)-LEN(SUBSTITUTE('Pers. Bil.'!C7,\" \",\"\"))),1)-1))","v":"ZELİHA"},{"$f":"IF(E13<0,0,MID('Pers. Bil.'!C7,LEN('XML Hes.'!F13)+2,LEN('Pers. Bil.'!C7)-LEN('XML Hes.'!F13)))","v":"OKUMUŞ"},null,{"$f":"'Pers. Bil.'!AD7","v":0},null,{"$f":"IF('Pers. Bil.'!Z7+'Pers. Bil.'!AA7+'Pers. Bil.'!AB7>0,('Pers. Bil.'!Z7+'Pers. Bil.'!AA7+'Pers. Bil.'!AB7)/7.5,0)","v":0},{"$f":"'Pers. Bil.'!F7","v":0},{"$f":"'Pers. Bil.'!H7","v":0},null,null,null,null,null,null,null,{"$f":"Bodro!#REF!-V13","v":{"$error":"#REF!"}},{"$f":"Bodro!#REF!+Bodro!#REF!","v":{"$error":"#REF!"}},944.19,{"$error":"#REF!"},null,{"$error":"#REF!"},{"$error":"#REF!"}]
[4,{"$f":"IF('Pers. Bil.'!#REF!=\"Ücretli Öğret.\",\"13\",\"05\")","v":{"$error":"#REF!"}},{"$error":"#REF!"},null,{"$f":"IF('Pers. Bil.'!#REF!=\"\",0,'Pers. Bil.'!#REF!)","v":{"$error":"#REF!"}},{"$f":"IF(E14<0,0,LEFT(SUBSTITUTE('Pers. Bil.'!#REF!,\" \",\"*\",LEN('Pers. Bil.'!#REF!)-LEN(SUBSTITUTE('Pers. Bil.'!#REF!,\" \",\"\"))),FIND(\"*\",SUBSTITUTE('Pers. Bil.'!#REF!,\" \",\"*\",LEN('Pers. Bil.'!#REF!)-LEN(SUBSTITUTE('Pers. Bil.'!#REF!,\" \",\"\"))),1)-1))","v":{"$error":"#REF!"}},{"$f":"IF(E14<0,0,MID('Pers. Bil.'!#REF!,LEN('XML Hes.'!F14)+2,LEN('Pers. Bil.'!#REF!)-LEN('XML Hes.'!F14)))","v":{"$error":"#REF!"}},null,{"$f":"'Pers. Bil.'!#REF!","v":{"$error":"#REF!"}},null,{"$f":"IF('Pers. Bil.'!#REF!+'Pers. Bil.'!#REF!+'Pers. Bil.'!#REF!>0,('Pers. Bil.'!#REF!+'Pers. Bil.'!#REF!+'Pers. Bil.'!#REF!)/7.5,0)","v":{"$error":"#REF!"}},{"$f":"'Pers. Bil.'!#REF!","v":{"$error":"#REF!"}},{"$f":"'Pers. Bil.'!#REF!","v":{"$error":"#REF!"}},null,null,null,null,null,null,null,{"$f":"Bodro!#REF!-V14","v":{"$error":"#REF!"}},{"$f":"Bodro!#REF!+Bodro!#REF!","v":{"$error":"#REF!"}},1036.6199999999999,{"$error":"#REF!"},null,{"$error":"#REF!"},{"$error":"#REF!"}]
[5,{"$f":"IF('Pers. Bil.'!D8=\"Ücretli Öğret.\",\"13\",\"05\")","v":"13"},"00000",null,{"$f":"IF('Pers. Bil.'!W8=\"\",0,'Pers. Bil.'!W8)","v":49891358388},{"$f":"IF(E15<0,0,LEFT(SUBSTITUTE('Pers. Bil.'!C8,\" \",\"*\",LEN('Pers. Bil.'!C8)-LEN(SUBSTITUTE('Pers. Bil.'!C8,\" \",\"\"))),FIND(\"*\",SUBSTITUTE('Pers. Bil.'!C8,\" \",\"*\",LEN('Pers. Bil.'!C8)-LEN(SUBSTITUTE('Pers. Bil.'!C8,\" \",\"\"))),1)-1))","v":"MUKADDES"},{"$f":"IF(E15<0,0,MID('Pers. Bil.'!C8,LEN('XML Hes.'!F15)+2,LEN('Pers. Bil.'!C8)-LEN('XML Hes.'!F15)))","v":"TABAK"},null,{"$f":"IF('Pers. Bil.'!W8=\"\",0,'Pers. Bil.'!AD8)","v":0},null,{"$f":"IF('Pers. Bil.'!Z8+'Pers. Bil.'!AA8+'Pers. Bil.'!AB8>0,'Pers. Bil.'!Z8+'Pers. Bil.'!AA8+'Pers. Bil.'!AB8/7.5)","v":false},{"$f":"'Pers. Bil.'!F8","v":0},{"$f":"'Pers. Bil.'!H8","v":0},null,null,null,null,null,null,null,{"$f":"Bodro!#REF!-V15","v":{"$error":"#REF!"}},{"$f":"Bodro!#REF!+Bodro!#REF!","v":{"$error":"#REF!"}},780.52,{"$error":"#REF!"},null,{"$error":"#REF!"},{"$error":"#REF!"}]
[6,{"$f":"IF('Pers. Bil.'!D9=\"Ücretli Öğret.\",\"13\",\"05\")","v":"13"},"00000",null,{"$f":"IF('Pers. Bil.'!W9=\"\",0,'Pers. Bil.'!W9)","v":49462372478},{"$f":"IF(E16<0,0,LEFT(SUBSTITUTE('Pers. Bil.'!C9,\" \",\"*\",LEN('Pers. Bil.'!C9)-LEN(SUBSTITUTE('Pers. Bil.'!C9,\" \",\"\"))),FIND(\"*\",SUBSTITUTE('Pers. Bil.'!C9,\" \",\"*\",LEN('Pers. Bil.'!C9)-LEN(SUBSTITUTE('Pers. Bil.'!C9,\" \",\"\"))),1)-1))","v":"VİLDAN"},{"$f":"IF(E16<0,0,MID('Pers. Bil.'!C9,LEN('XML Hes.'!F16)+2,LEN('Pers. Bil.'!C9)-LEN('XML Hes.'!F16)))","v":"GEYİK"},null,{"$f":"IF('Pers. Bil.'!W9=\"\",0,'Pers. Bil.'!AD9)","v":330.23},null,{"$f":"IF('Pers. Bil.'!Z9+'Pers. Bil.'!AA9+'Pers. Bil.'!AB9>0,'Pers. Bil.'!Z9+'Pers. Bil.'!AA9+'Pers. Bil.'!AB9/7.5)","v":20},{"$f":"'Pers. Bil.'!F9","v":0},{"$f":"'Pers. Bil.'!H9","v":0},null,null,null,null,null,null,null,{"$f":"Bodro!#REF!-V16","v":{"$error":"#REF!"}},{"$f":"Bodro!#REF!+Bodro!#REF!","v":{"$error":"#REF!"}},780.52,{"$error":"#REF!"},null,{"$error":"#REF!"},{"$error":"#REF!"}]
[7,{"$f":"IF('Pers. Bil.'!D10=\"Ücretli Öğret.\",\"13\",\"05\")","v":"05"},"",null,{"$f":"IF('Pers. Bil.'!W10=\"\",0,'Pers. Bil.'!W10)","v":0},{"$f":"IF(E17<0,0,LEFT(SUBSTITUTE('Pers. Bil.'!C10,\" \",\"*\",LEN('Pers. Bil.'!C10)-LEN(SUBSTITUTE('Pers. Bil.'!C10,\" \",\"\"))),FIND(\"*\",SUBSTITUTE('Pers. Bil.'!C10,\" \",\"*\",LEN('Pers. Bil.'!C10)-LEN(SUBSTITUTE('Pers. Bil.'!C10,\" \",\"\"))),1)-1))","v":{"$error":"#VALUE!"}},{"$f":"IF(E17<0,0,MID('Pers. Bil.'!C10,LEN('XML Hes.'!F17)+2,LEN('Pers. Bil.'!C10)-LEN('XML Hes.'!F17)))","v":{"$error":"#VALUE!"}},null,{"$f":"IF('Pers. Bil.'!W10=\"\",0,'Pers. Bil.'!AD10)","v":0},null,{"$f":"IF('Pers. Bil.'!Z10+'Pers. Bil.'!AA10+'Pers. Bil.'!AB10>0,'Pers. Bil.'!Z10+'Pers. Bil.'!AA10+'Pers. Bil.'!AB10/7.5)","v":false},{"$f":"'Pers. Bil.'!F10","v":0},{"$f":"'Pers. Bil.'!H10","v":0},null,null,null,null,null,null,null,{"$f":"Bodro!I10-V17","v":{"$error":"#REF!"}},{"$f":"Bodro!#REF!+Bodro!#REF!","v":{"$error":"#REF!"}},780.52,{"$error":"#REF!"},null,{"$error":"#REF!"},{"$error":"#REF!"}]
[8,{"$f":"IF('Pers. Bil.'!D11=\"Ücretli Öğret.\",\"13\",\"05\")","v":"05"},"",null,{"$f":"IF('Pers. Bil.'!W11=\"\",0,'Pers. Bil.'!W11)","v":0},{"$f":"IF(E18<0,0,LEFT(SUBSTITUTE('Pers. Bil.'!C11,\" \",\"*\",LEN('Pers. Bil.'!C11)-LEN(SUBSTITUTE('Pers. Bil.'!C11,\" \",\"\"))),FIND(\"*\",SUBSTITUTE('Pers. Bil.'!C11,\" \",\"*\",LEN('Pers. Bil.'!C11)-LEN(SUBSTITUTE('Pers. Bil.'!C11,\" \",\"\"))),1)-1))","v":{"$error":"#VALUE!"}},{"$f":"IF(E18<0,0,MID('Pers. Bil.'!C11,LEN('XML Hes.'!F18)+2,LEN('Pers. Bil.'!C11)-LEN('XML Hes.'!F18)))","v":{"$error":"#VALUE!"}},null,{"$f":"IF('Pers. Bil.'!W11=\"\",0,'Pers. Bil.'!AD11)","v":0},null,{"$f":"IF('Pers. Bil.'!Z11+'Pers. Bil.'!AA11+'Pers. Bil.'!AB11>0,'Pers. Bil.'!Z11+'Pers. Bil.'!AA11+'Pers. Bil.'!AB11/7.5)","v":false},{"$f":"'Pers. Bil.'!F11","v":0},{"$f":"'Pers. Bil.'!H11","v":0},null,null,null,null,null,null,null,{"$f":"Bodro!I11-V18","v":{"$error":"#REF!"}},{"$f":"Bodro!#REF!+Bodro!#REF!","v":{"$error":"#REF!"}},1170,{"$error":"#REF!"},null,{"$error":"#REF!"},{"$error":"#REF!"}]
[9,{"$f":"IF('Pers. Bil.'!D12=\"Ücretli Öğret.\",\"13\",\"05\")","v":"05"},"",null,{"$f":"IF('Pers. Bil.'!W12=\"\",0,'Pers. Bil.'!W12)","v":0},{"$f":"IF(E19<0,0,LEFT(SUBSTITUTE('Pers. Bil.'!C12,\" \",\"*\",LEN('Pers. Bil.'!C12)-LEN(SUBSTITUTE('Pers. Bil.'!C12,\" \",\"\"))),FIND(\"*\",SUBSTITUTE('Pers. Bil.'!C12,\" \",\"*\",LEN('Pers. Bil.'!C12)-LEN(SUBSTITUTE('Pers. Bil.'!C12,\" \",\"\"))),1)-1))","v":{"$error":"#VALUE!"}},{"$f":"IF(E19<0,0,MID('Pers. Bil.'!C12,LEN('XML Hes.'!F19)+2,LEN('Pers. Bil.'!C12)-LEN('XML Hes.'!F19)))","v":{"$error":"#VALUE!"}},null,{"$f":"IF('Pers. Bil.'!W12=\"\",0,'Pers. Bil.'!AD12)","v":0},null,{"$f":"IF('Pers. Bil.'!Z12+'Pers. Bil.'!AA12+'Pers. Bil.'!AB12>0,'Pers. Bil.'!Z12+'Pers. Bil.'!AA12+'Pers. Bil.'!AB12/7.5)","v":false},{"$f":"'Pers. Bil.'!F12","v":0},{"$f":"'Pers. Bil.'!H12","v":0},null,null,null,null,null,null,null,{"$f":"Bodro!I20-V19","v":{"$error":"#REF!"}},{"$f":"Bodro!#REF!+Bodro!#REF!","v":{"$error":"#REF!"}},1141.01,{"$error":"#REF!"},null,{"$error":"#REF!"},{"$error":"#REF!"}]
[10,{"$f":"IF('Pers. Bil.'!D13=\"Ücretli Öğret.\",\"13\",\"05\")","v":"05"},"",null,{"$f":"IF('Pers. Bil.'!W13=\"\",0,'Pers. Bil.'!W13)","v":0},{"$f":"IF(E20<0,0,LEFT(SUBSTITUTE('Pers. Bil.'!C13,\" \",\"*\",LEN('Pers. Bil.'!C13)-LEN(SUBSTITUTE('Pers. Bil.'!C13,\" \",\"\"))),FIND(\"*\",SUBSTITUTE('Pers. Bil.'!C13,\" \",\"*\",LEN('Pers. Bil.'!C13)-LEN(SUBSTITUTE('Pers. Bil.'!C13,\" \",\"\"))),1)-1))","v":{"$error":"#VALUE!"}},{"$f":"IF(E20<0,0,MID('Pers. Bil.'!C13,LEN('XML Hes.'!F20)+2,LEN('Pers. Bil.'!C13)-LEN('XML Hes.'!F20)))","v":{"$error":"#VALUE!"}},null,{"$f":"IF('Pers. Bil.'!W13=\"\",0,'Pers. Bil.'!AD13)","v":0},null,{"$f":"IF('Pers. Bil.'!Z13+'Pers. Bil.'!AA13+'Pers. Bil.'!AB13>0,'Pers. Bil.'!Z13+'Pers. Bil.'!AA13+'Pers. Bil.'!AB13/7.5)","v":false},{"$f":"'Pers. Bil.'!F13","v":0},{"$f":"'Pers. Bil.'!H13","v":0},null,null,null,null,null,null,null,{"$f":"Bodro!I21-V20","v":{"$error":"#REF!"}},{"$f":"Bodro!#REF!+Bodro!#REF!","v":{"$error":"#REF!"}},1016.34,{"$error":"#REF!"},null,{"$error":"#REF!"},{"$error":"#REF!"}]
[11,{"$f":"IF('Pers. Bil.'!D14=\"Ücretli Öğret.\",\"13\",\"05\")","v":"05"},"",null,{"$f":"IF('Pers. Bil.'!W14=\"\",0,'Pers. Bil.'!W14)","v":0},{"$f":"IF(E21<0,0,LEFT(SUBSTITUTE('Pers. Bil.'!C14,\" \",\"*\",LEN('Pers. Bil.'!C14)-LEN(SUBSTITUTE('Pers. Bil.'!C14,\" \",\"\"))),FIND(\"*\",SUBSTITUTE('Pers. Bil.'!C14,\" \",\"*\",LEN('Pers. Bil.'!C14)-LEN(SUBSTITUTE('Pers. Bil.'!C14,\" \",\"\"))),1)-1))","v":{"$error":"#VALUE!"}},{"$f":"IF(E21<0,0,MID('Pers. Bil.'!C14,LEN('XML Hes.'!F21)+2,LEN('Pers. Bil.'!C14)-LEN('XML Hes.'!F21)))","v":{"$error":"#VALUE!"}},null,{"$f":"IF('Pers. Bil.'!W14=\"\",0,'Pers. Bil.'!AD14)","v":0},null,{"$f":"IF('Pers. Bil.'!Z14+'Pers. Bil.'!AA14+'Pers. Bil.'!AB14>0,'Pers. Bil.'!Z14+'Pers. Bil.'!AA14+'Pers. Bil.'!AB14/7.5)","v":false},{"$f":"'Pers. Bil.'!F14","v":0},{"$f":"'Pers. Bil.'!H14","v":0},null,null,null,null,null,null,null,{"$f":"Bodro!I22-V21","v":{"$error":"#REF!"}},{"$f":"Bodro!#REF!+Bodro!#REF!","v":{"$error":"#REF!"}},959.4,{"$error":"#REF!"},null,{"$error":"#REF!"},{"$error":"#REF!"}]
[12,{"$f":"IF('Pers. Bil.'!D15=\"Ücretli Öğret.\",\"13\",\"05\")","v":"05"},"",null,{"$f":"IF('Pers. Bil.'!W15=\"\",0,'Pers. Bil.'!W15)","v":0},{"$f":"IF(E22<0,0,LEFT(SUBSTITUTE('Pers. Bil.'!C15,\" \",\"*\",LEN('Pers. Bil.'!C15)-LEN(SUBSTITUTE('Pers. Bil.'!C15,\" \",\"\"))),FIND(\"*\",SUBSTITUTE('Pers. Bil.'!C15,\" \",\"*\",LEN('Pers. Bil.'!C15)-LEN(SUBSTITUTE('Pers. Bil.'!C15,\" \",\"\"))),1)-1))","v":{"$error":"#VALUE!"}},{"$f":"IF(E22<0,0,MID('Pers. Bil.'!C15,LEN('XML Hes.'!F22)+2,LEN('Pers. Bil.'!C15)-LEN('XML Hes.'!F22)))","v":{"$error":"#VALUE!"}},null,{"$f":"IF('Pers. Bil.'!W15=\"\",0,'Pers. Bil.'!AD15)","v":0},null,{"$f":"IF('Pers. Bil.'!Z15+'Pers. Bil.'!AA15+'Pers. Bil.'!AB15>0,'Pers. Bil.'!Z15+'Pers. Bil.'!AA15+'Pers. Bil.'!AB15/7.5)","v":false},{"$f":"'Pers. Bil.'!F15","v":0},{"$f":"'Pers. Bil.'!H15","v":0},null,null,null,null,null,null,null,{"$f":"Bodro!I23-V22","v":{"$error":"#REF!"}},{"$f":"Bodro!#REF!+Bodro!#REF!","v":{"$error":"#REF!"}},1149.8499999999999,{"$error":"#REF!"},null,{"$error":"#REF!"},{"$error":"#REF!"}]
[13,{"$f":"IF('Pers. Bil.'!D16=\"Ücretli Öğret.\",\"13\",\"05\")","v":"05"},"",null,{"$f":"IF('Pers. Bil.'!W16=\"\",0,'Pers. Bil.'!W16)","v":0},{"$f":"IF(E23<0,0,LEFT(SUBSTITUTE('Pers. Bil.'!C16,\" \",\"*\",LEN('Pers. Bil.'!C16)-LEN(SUBSTITUTE('Pers. Bil.'!C16,\" \",\"\"))),FIND(\"*\",SUBSTITUTE('Pers. Bil.'!C16,\" \",\"*\",LEN('Pers. Bil.'!C16)-LEN(SUBSTITUTE('Pers. Bil.'!C16,\" \",\"\"))),1)-1))","v":{"$error":"#VALUE!"}},{"$f":"IF(E23<0,0,MID('Pers. Bil.'!C16,LEN('XML Hes.'!F23)+2,LEN('Pers. Bil.'!C16)-LEN('XML Hes.'!F23)))","v":{"$error":"#VALUE!"}},null,{"$f":"IF('Pers. Bil.'!W16=\"\",0,'Pers. Bil.'!AD16)","v":0},null,{"$f":"IF('Pers. Bil.'!Z16+'Pers. Bil.'!AA16+'Pers. Bil.'!AB16>0,'Pers. Bil.'!Z16+'Pers. Bil.'!AA16+'Pers. Bil.'!AB16/7.5)","v":false},{"$f":"'Pers. Bil.'!F16","v":0},{"$f":"'Pers. Bil.'!H16","v":0},null,null,null,null,null,null,null,{"$f":"Bodro!I24-V23","v":{"$error":"#REF!"}},{"$f":"Bodro!#REF!+Bodro!#REF!","v":{"$error":"#REF!"}},780.52,{"$error":"#REF!"},null,{"$error":"#REF!"},{"$error":"#REF!"}]
[14,{"$f":"IF('Pers. Bil.'!D17=\"Ücretli Öğret.\",\"13\",\"05\")","v":"05"},"",null,{"$f":"IF('Pers. Bil.'!W17=\"\",0,'Pers. Bil.'!W17)","v":0},{"$f":"IF(E24<0,0,LEFT(SUBSTITUTE('Pers. Bil.'!C17,\" \",\"*\",LEN('Pers. Bil.'!C17)-LEN(SUBSTITUTE('Pers. Bil.'!C17,\" \",\"\"))),FIND(\"*\",SUBSTITUTE('Pers. Bil.'!C17,\" \",\"*\",LEN('Pers. Bil.'!C17)-LEN(SUBSTITUTE('Pers. Bil.'!C17,\" \",\"\"))),1)-1))","v":{"$error":"#VALUE!"}},{"$f":"IF(E24<0,0,MID('Pers. Bil.'!C17,LEN('XML Hes.'!F24)+2,LEN('Pers. Bil.'!C17)-LEN('XML Hes.'!F24)))","v":{"$error":"#VALUE!"}},null,{"$f":"IF('Pers. Bil.'!W17=\"\",0,'Pers. Bil.'!AD17)","v":0},null,{"$f":"IF('Pers. Bil.'!Z17+'Pers. Bil.'!AA17+'Pers. Bil.'!AB17>0,'Pers. Bil.'!Z17+'Pers. Bil.'!AA17+'Pers. Bil.'!AB17/7.5)","v":false},{"$f":"'Pers. Bil.'!F17","v":0},{"$f":"'Pers. Bil.'!H17","v":0},null,null,null,null,null,null,null,{"$f":"Bodro!I25-V24","v":{"$error":"#REF!"}},{"$f":"Bodro!#REF!+Bodro!#REF!","v":{"$error":"#REF!"}},780.52,{"$error":"#REF!"},null,{"$error":"#REF!"},{"$error":"#REF!"}]
[15,{"$f":"IF('Pers. Bil.'!D18=\"Ücretli Öğret.\",\"13\",\"05\")","v":"05"},"",null,{"$f":"IF('Pers. Bil.'!W18=\"\",0,'Pers. Bil.'!W18)","v":0},{"$f":"IF(E25<0,0,LEFT(SUBSTITUTE('Pers. Bil.'!C18,\" \",\"*\",LEN('Pers. Bil.'!C18)-LEN(SUBSTITUTE('Pers. Bil.'!C18,\" \",\"\"))),FIND(\"*\",SUBSTITUTE('Pers. Bil.'!C18,\" \",\"*\",LEN('Pers. Bil.'!C18)-LEN(SUBSTITUTE('Pers. Bil.'!C18,\" \",\"\"))),1)-1))","v":{"$error":"#VALUE!"}},{"$f":"IF(E25<0,0,MID('Pers. Bil.'!C18,LEN('XML Hes.'!F25)+2,LEN('Pers. Bil.'!C18)-LEN('XML Hes.'!F25)))","v":{"$error":"#VALUE!"}},null,{"$f":"IF('Pers. Bil.'!W18=\"\",0,'Pers. Bil.'!AD18)","v":0},null,{"$f":"IF('Pers. Bil.'!Z18+'Pers. Bil.'!AA18+'Pers. Bil.'!AB18>0,'Pers. Bil.'!Z18+'Pers. Bil.'!AA18+'Pers. Bil.'!AB18/7.5)","v":false},{"$f":"'Pers. Bil.'!F18","v":0},{"$f":"'Pers. Bil.'!H18","v":0},null,null,null,null,null,null,null,{"$f":"Bodro!I26-V25","v":{"$error":"#REF!"}},{"$f":"Bodro!#REF!+Bodro!#REF!","v":{"$error":"#REF!"}},780.52,{"$error":"#REF!"},null,{"$error":"#REF!"},{"$error":"#REF!"}]
[16,{"$f":"IF('Pers. Bil.'!D19=\"Ücretli Öğret.\",\"13\",\"05\")","v":"05"},"",null,{"$f":"IF('Pers. Bil.'!W19=\"\",0,'Pers. Bil.'!W19)","v":0},{"$f":"IF(E26<0,0,LEFT(SUBSTITUTE('Pers. Bil.'!C19,\" \",\"*\",LEN('Pers. Bil.'!C19)-LEN(SUBSTITUTE('Pers. Bil.'!C19,\" \",\"\"))),FIND(\"*\",SUBSTITUTE('Pers. Bil.'!C19,\" \",\"*\",LEN('Pers. Bil.'!C19)-LEN(SUBSTITUTE('Pers. Bil.'!C19,\" \",\"\"))),1)-1))","v":{"$error":"#VALUE!"}},{"$f":"IF(E26<0,0,MID('Pers. Bil.'!C19,LEN('XML Hes.'!F26)+2,LEN('Pers. Bil.'!C19)-LEN('XML Hes.'!F26)))","v":{"$error":"#VALUE!"}},null,{"$f":"IF('Pers. Bil.'!W19=\"\",0,'Pers. Bil.'!AD19)","v":0},null,{"$f":"IF('Pers. Bil.'!Z19+'Pers. Bil.'!AA19+'Pers. Bil.'!AB19>0,'Pers. Bil.'!Z19+'Pers. Bil.'!AA19+'Pers. Bil.'!AB19/7.5)","v":false},{"$f":"'Pers. Bil.'!F19","v":0},{"$f":"'Pers. Bil.'!H19","v":0},null,null,null,null,null,null,null,{"$f":"Bodro!I27-V26","v":{"$error":"#REF!"}},{"$f":"Bodro!#REF!+Bodro!#REF!","v":{"$error":"#REF!"}},780.52,{"$error":"#REF!"},null,{"$error":"#REF!"},{"$error":"#REF!"}]
[17,{"$f":"IF('Pers. Bil.'!D20=\"Ücretli Öğret.\",\"13\",\"05\")","v":"05"},"",null,{"$f":"IF('Pers. Bil.'!W20=\"\",0,'Pers. Bil.'!W20)","v":0},{"$f":"IF(E27<0,0,LEFT(SUBSTITUTE('Pers. Bil.'!C20,\" \",\"*\",LEN('Pers. Bil.'!C20)-LEN(SUBSTITUTE('Pers. Bil.'!C20,\" \",\"\"))),FIND(\"*\",SUBSTITUTE('Pers. Bil.'!C20,\" \",\"*\",LEN('Pers. Bil.'!C20)-LEN(SUBSTITUTE('Pers. Bil.'!C20,\" \",\"\"))),1)-1))","v":{"$error":"#VALUE!"}},{"$f":"IF(E27<0,0,MID('Pers. Bil.'!C20,LEN('XML Hes.'!F27)+2,LEN('Pers. Bil.'!C20)-LEN('XML Hes.'!F27)))","v":{"$error":"#VALUE!"}},null,{"$f":"IF('Pers. Bil.'!W20=\"\",0,'Pers. Bil.'!AD20)","v":0},null,{"$f":"IF('Pers. Bil.'!Z20+'Pers. Bil.'!AA20+'Pers. Bil.'!AB20>0,'Pers. Bil.'!Z20+'Pers. Bil.'!AA20+'Pers. Bil.'!AB20/7.5)","v":false},{"$f":"'Pers. Bil.'!F20","v":0},{"$f":"'Pers. Bil.'!H20","v":0},null,null,null,null,null,null,null,{"$f":"Bodro!I28-V27","v":{"$error":"#REF!"}},{"$f":"Bodro!#REF!+Bodro!#REF!","v":{"$error":"#REF!"}},780.52,{"$error":"#REF!"},null,{"$error":"#REF!"},{"$error":"#REF!"}]
[18,{"$f":"IF('Pers. Bil.'!D21=\"Ücretli Öğret.\",\"13\",\"05\")","v":"05"},"",null,{"$f":"IF('Pers. Bil.'!W21=\"\",0,'Pers. Bil.'!W21)","v":0},{"$f":"IF(E28<0,0,LEFT(SUBSTITUTE('Pers. Bil.'!C21,\" \",\"*\",LEN('Pers. Bil.'!C21)-LEN(SUBSTITUTE('Pers. Bil.'!C21,\" \",\"\"))),FIND(\"*\",SUBSTITUTE('Pers. Bil.'!C21,\" \",\"*\",LEN('Pers. Bil.'!C21)-LEN(SUBSTITUTE('Pers. Bil.'!C21,\" \",\"\"))),1)-1))","v":{"$error":"#VALUE!"}},{"$f":"IF(E28<0,0,MID('Pers. Bil.'!C21,LEN('XML Hes.'!F28)+2,LEN('Pers. Bil.'!C21)-LEN('XML Hes.'!F28)))","v":{"$error":"#VALUE!"}},null,{"$f":"IF('Pers. Bil.'!W21=\"\",0,'Pers. Bil.'!AD21)","v":0},null,{"$f":"IF('Pers. Bil.'!Z21+'Pers. Bil.'!AA21+'Pers. Bil.'!AB21>0,'Pers. Bil.'!Z21+'Pers. Bil.'!AA21+'Pers. Bil.'!AB21/7.5)","v":false},{"$f":"'Pers. Bil.'!F21","v":0},{"$f":"'Pers. Bil.'!H21","v":0},null,null,null,null,null,null,null,{"$f":"Bodro!#REF!-V28","v":{"$error":"#REF!"}},{"$f":"Bodro!#REF!+Bodro!#REF!","v":{"$error":"#REF!"}},1189.1099999999999,{"$error":"#REF!"},null,{"$error":"#REF!"},{"$error":"#REF!"}]
[19,{"$f":"IF('Pers. Bil.'!D22=\"Ücretli Öğret.\",\"13\",\"05\")","v":"05"},"",null,{"$f":"IF('Pers. Bil.'!W22=\"\",0,'Pers. Bil.'!W22)","v":0},{"$f":"IF(E29<0,0,LEFT(SUBSTITUTE('Pers. Bil.'!C22,\" \",\"*\",LEN('Pers. Bil.'!C22)-LEN(SUBSTITUTE('Pers. Bil.'!C22,\" \",\"\"))),FIND(\"*\",SUBSTITUTE('Pers. Bil.'!C22,\" \",\"*\",LEN('Pers. Bil.'!C22)-LEN(SUBSTITUTE('Pers. Bil.'!C22,\" \",\"\"))),1)-1))","v":{"$error":"#VALUE!"}},{"$f":"IF(E29<0,0,MID('Pers. Bil.'!C22,LEN('XML Hes.'!F29)+2,LEN('Pers. Bil.'!C22)-LEN('XML Hes.'!F29)))","v":{"$error":"#VALUE!"}},null,{"$f":"IF('Pers. Bil.'!W22=\"\",0,'Pers. Bil.'!AD22)","v":0},null,{"$f":"IF('Pers. Bil.'!Z22+'Pers. Bil.'!AA22+'Pers. Bil.'!AB22>0,'Pers. Bil.'!Z22+'Pers. Bil.'!AA22+'Pers. Bil.'!AB22/7.5)","v":false},{"$f":"'Pers. Bil.'!F22","v":0},{"$f":"'Pers. Bil.'!H22","v":0},null,null,null,null,null,null,null,{"$f":"Bodro!#REF!-V29","v":{"$error":"#REF!"}},{"$f":"Bodro!#REF!+Bodro!#REF!","v":{"$error":"#REF!"}},944.19,{"$error":"#REF!"},null,{"$error":"#REF!"},{"$error":"#REF!"}]
[20,{"$f":"IF('Pers. Bil.'!D23=\"Ücretli Öğret.\",\"13\",\"05\")","v":"05"},"",null,{"$f":"IF('Pers. Bil.'!W23=\"\",0,'Pers. Bil.'!W23)","v":0},{"$f":"IF(E30<0,0,LEFT(SUBSTITUTE('Pers. Bil.'!C23,\" \",\"*\",LEN('Pers. Bil.'!C23)-LEN(SUBSTITUTE('Pers. Bil.'!C23,\" \",\"\"))),FIND(\"*\",SUBSTITUTE('Pers. Bil.'!C23,\" \",\"*\",LEN('Pers. Bil.'!C23)-LEN(SUBSTITUTE('Pers. Bil.'!C23,\" \",\"\"))),1)-1))","v":{"$error":"#VALUE!"}},{"$f":"IF(E30<0,0,MID('Pers. Bil.'!C23,LEN('XML Hes.'!F30)+2,LEN('Pers. Bil.'!C23)-LEN('XML Hes.'!F30)))","v":{"$error":"#VALUE!"}},null,{"$f":"IF('Pers. Bil.'!W23=\"\",0,'Pers. Bil.'!AD23)","v":0},null,{"$f":"IF('Pers. Bil.'!Z23+'Pers. Bil.'!AA23+'Pers. Bil.'!AB23>0,'Pers. Bil.'!Z23+'Pers. Bil.'!AA23+'Pers. Bil.'!AB23/7.5)","v":false},{"$f":"'Pers. Bil.'!F23","v":0},{"$f":"'Pers. Bil.'!H23","v":0},null,null,null,null,null,null,null,{"$f":"Bodro!#REF!-V30","v":{"$error":"#REF!"}},{"$f":"Bodro!#REF!+Bodro!#REF!","v":{"$error":"#REF!"}},778.18,{"$error":"#REF!"},null,{"$error":"#REF!"},{"$error":"#REF!"}]
[21,{"$f":"IF('Pers. Bil.'!D24=\"Ücretli Öğret.\",\"13\",\"05\")","v":"05"},"",null,{"$f":"IF('Pers. Bil.'!W24=\"\",0,'Pers. Bil.'!W24)","v":0},{"$f":"IF(E31<0,0,LEFT(SUBSTITUTE('Pers. Bil.'!C24,\" \",\"*\",LEN('Pers. Bil.'!C24)-LEN(SUBSTITUTE('Pers. Bil.'!C24,\" \",\"\"))),FIND(\"*\",SUBSTITUTE('Pers. Bil.'!C24,\" \",\"*\",LEN('Pers. Bil.'!C24)-LEN(SUBSTITUTE('Pers. Bil.'!C24,\" \",\"\"))),1)-1))","v":{"$error":"#VALUE!"}},{"$f":"IF(E31<0,0,MID('Pers. Bil.'!C24,LEN('XML Hes.'!F31)+2,LEN('Pers. Bil.'!C24)-LEN('XML Hes.'!F31)))","v":{"$error":"#VALUE!"}},null,{"$f":"IF('Pers. Bil.'!W24=\"\",0,'Pers. Bil.'!AD24)","v":0},null,{"$f":"IF('Pers. Bil.'!Z24+'Pers. Bil.'!AA24+'Pers. Bil.'!AB24>0,'Pers. Bil.'!Z24+'Pers. Bil.'!AA24+'Pers. Bil.'!AB24/7.5)","v":20},{"$f":"'Pers. Bil.'!F24","v":0},{"$f":"'Pers. Bil.'!H24","v":0},null,null,null,null,null,null,null,{"$f":"Bodro!#REF!-V31","v":{"$error":"#REF!"}},{"$f":"Bodro!#REF!+Bodro!#REF!","v":{"$error":"#REF!"}},778.18,{"$error":"#REF!"},null,{"$error":"#REF!"},{"$error":"#REF!"}]
[22,{"$f":"IF('Pers. Bil.'!D25=\"Ücretli Öğret.\",\"13\",\"05\")","v":"05"},"",null,{"$f":"IF('Pers. Bil.'!W25=\"\",0,'Pers. Bil.'!W25)","v":0},{"$f":"IF(E32<0,0,LEFT(SUBSTITUTE('Pers. Bil.'!C25,\" \",\"*\",LEN('Pers. Bil.'!C25)-LEN(SUBSTITUTE('Pers. Bil.'!C25,\" \",\"\"))),FIND(\"*\",SUBSTITUTE('Pers. Bil.'!C25,\" \",\"*\",LEN('Pers. Bil.'!C25)-LEN(SUBSTITUTE('Pers. Bil.'!C25,\" \",\"\"))),1)-1))","v":{"$error":"#VALUE!"}},{"$f":"IF(E32<0,0,MID('Pers. Bil.'!C25,LEN('XML Hes.'!F32)+2,LEN('Pers. Bil.'!C25)-LEN('XML Hes.'!F32)))","v":{"$error":"#VALUE!"}},null,{"$f":"IF('Pers. Bil.'!W25=\"\",0,'Pers. Bil.'!AD25)","v":0},null,{"$f":"IF('Pers. Bil.'!Z25+'Pers. Bil.'!AA25+'Pers. Bil.'!AB25>0,'Pers. Bil.'!Z25+'Pers. Bil.'!AA25+'Pers. Bil.'!AB25/7.5)","v":false},{"$f":"'Pers. Bil.'!F25","v":0},{"$f":"'Pers. Bil.'!H25","v":0},null,null,null,null,null,null,null,{"$f":"Bodro!#REF!-V32","v":{"$error":"#REF!"}},{"$f":"Bodro!#REF!+Bodro!#REF!","v":{"$error":"#REF!"}},720.98,{"$error":"#REF!"},null,{"$error":"#REF!"},{"$error":"#REF!"}]
[23,{"$f":"IF('Pers. Bil.'!D26=\"Ücretli Öğret.\",\"13\",\"05\")","v":"05"},"",null,{"$f":"IF('Pers. Bil.'!W26=\"\",0,'Pers. Bil.'!W26)","v":0},{"$f":"IF(E33<0,0,LEFT(SUBSTITUTE('Pers. Bil.'!C26,\" \",\"*\",LEN('Pers. Bil.'!C26)-LEN(SUBSTITUTE('Pers. Bil.'!C26,\" \",\"\"))),FIND(\"*\",SUBSTITUTE('Pers. Bil.'!C26,\" \",\"*\",LEN('Pers. Bil.'!C26)-LEN(SUBSTITUTE('Pers. Bil.'!C26,\" \",\"\"))),1)-1))","v":{"$error":"#VALUE!"}},{"$f":"IF(E33<0,0,MID('Pers. Bil.'!C26,LEN('XML Hes.'!F33)+2,LEN('Pers. Bil.'!C26)-LEN('XML Hes.'!F33)))","v":{"$error":"#VALUE!"}},null,{"$f":"IF('Pers. Bil.'!W26=\"\",0,'Pers. Bil.'!AD26)","v":0},null,{"$f":"IF('Pers. Bil.'!Z26+'Pers. Bil.'!AA26+'Pers. Bil.'!AB26>0,'Pers. Bil.'!Z26+'Pers. Bil.'!AA26+'Pers. Bil.'!AB26/7.5)","v":false},{"$f":"'Pers. Bil.'!F26","v":0},{"$f":"'Pers. Bil.'!H26","v":0},null,null,null,null,null,null,null,{"$f":"Bodro!#REF!-V33","v":{"$error":"#REF!"}},{"$f":"Bodro!#REF!+Bodro!#REF!","v":{"$error":"#REF!"}},778.18,{"$error":"#REF!"},null,{"$error":"#REF!"},{"$error":"#REF!"}]
[24,{"$f":"IF('Pers. Bil.'!D27=\"Ücretli Öğret.\",\"13\",\"05\")","v":"05"},"",null,{"$f":"IF('Pers. Bil.'!W27=\"\",0,'Pers. Bil.'!W27)","v":0},{"$f":"IF(E34<0,0,LEFT(SUBSTITUTE('Pers. Bil.'!C27,\" \",\"*\",LEN('Pers. Bil.'!C27)-LEN(SUBSTITUTE('Pers. Bil.'!C27,\" \",\"\"))),FIND(\"*\",SUBSTITUTE('Pers. Bil.'!C27,\" \",\"*\",LEN('Pers. Bil.'!C27)-LEN(SUBSTITUTE('Pers. Bil.'!C27,\" \",\"\"))),1)-1))","v":{"$error":"#VALUE!"}},{"$f":"IF(E34<0,0,MID('Pers. Bil.'!C27,LEN('XML Hes.'!F34)+2,LEN('Pers. Bil.'!C27)-LEN('XML Hes.'!F34)))","v":{"$error":"#VALUE!"}},null,{"$f":"IF('Pers. Bil.'!W27=\"\",0,'Pers. Bil.'!AD27)","v":0},null,{"$f":"IF('Pers. Bil.'!Z27+'Pers. Bil.'!AA27+'Pers. Bil.'!AB27>0,'Pers. Bil.'!Z27+'Pers. Bil.'!AA27+'Pers. Bil.'!AB27/7.5)","v":false},{"$f":"'Pers. Bil.'!F27","v":0},{"$f":"'Pers. Bil.'!H27","v":0},null,null,null,null,null,null,null,{"$f":"Bodro!#REF!-V34","v":{"$error":"#REF!"}},{"$f":"Bodro!#REF!+Bodro!#REF!","v":{"$error":"#REF!"}},723.84,{"$error":"#REF!"},null,{"$error":"#REF!"},{"$error":"#REF!"}]
[25,{"$f":"IF('Pers. Bil.'!D28=\"Ücretli Öğret.\",\"13\",\"05\")","v":"05"},"",null,{"$f":"IF('Pers. Bil.'!W28=\"\",0,'Pers. Bil.'!W28)","v":0},{"$f":"IF(E35<0,0,LEFT(SUBSTITUTE('Pers. Bil.'!C28,\" \",\"*\",LEN('Pers. Bil.'!C28)-LEN(SUBSTITUTE('Pers. Bil.'!C28,\" \",\"\"))),FIND(\"*\",SUBSTITUTE('Pers. Bil.'!C28,\" \",\"*\",LEN('Pers. Bil.'!C28)-LEN(SUBSTITUTE('Pers. Bil.'!C28,\" \",\"\"))),1)-1))","v":{"$error":"#VALUE!"}},{"$f":"IF(E35<0,0,MID('Pers. Bil.'!C28,LEN('XML Hes.'!F35)+2,LEN('Pers. Bil.'!C28)-LEN('XML Hes.'!F35)))","v":{"$error":"#VALUE!"}},null,{"$f":"IF('Pers. Bil.'!W28=\"\",0,'Pers. Bil.'!AD28)","v":0},null,{"$f":"IF('Pers. Bil.'!Z28+'Pers. Bil.'!AA28+'Pers. Bil.'!AB28>0,'Pers. Bil.'!Z28+'Pers. Bil.'!AA28+'Pers. Bil.'!AB28/7.5)","v":false},{"$f":"'Pers. Bil.'!F28","v":0},{"$f":"'Pers. Bil.'!H28","v":0},null,null,null,null,null,null,null,{"$f":"Bodro!#REF!-V35","v":{"$error":"#REF!"}},{"$f":"Bodro!#REF!+Bodro!#REF!","v":{"$error":"#REF!"}},683.54,{"$error":"#REF!"},null,{"$error":"#REF!"},{"$error":"#REF!"}]
[26,{"$f":"IF('Pers. Bil.'!D29=\"Ücretli Öğret.\",\"13\",\"05\")","v":"05"},"",null,{"$f":"IF('Pers. Bil.'!W29=\"\",0,'Pers. Bil.'!W29)","v":0},{"$f":"IF(E36<0,0,LEFT(SUBSTITUTE('Pers. Bil.'!C29,\" \",\"*\",LEN('Pers. Bil.'!C29)-LEN(SUBSTITUTE('Pers. Bil.'!C29,\" \",\"\"))),FIND(\"*\",SUBSTITUTE('Pers. Bil.'!C29,\" \",\"*\",LEN('Pers. Bil.'!C29)-LEN(SUBSTITUTE('Pers. Bil.'!C29,\" \",\"\"))),1)-1))","v":{"$error":"#VALUE!"}},{"$f":"IF(E36<0,0,MID('Pers. Bil.'!C29,LEN('XML Hes.'!F36)+2,LEN('Pers. Bil.'!C29)-LEN('XML Hes.'!F36)))","v":{"$error":"#VALUE!"}},null,{"$f":"IF('Pers. Bil.'!W29=\"\",0,'Pers. Bil.'!AD29)","v":0},null,{"$f":"IF('Pers. Bil.'!Z29+'Pers. Bil.'!AA29+'Pers. Bil.'!AB29>0,'Pers. Bil.'!Z29+'Pers. Bil.'!AA29+'Pers. Bil.'!AB29/7.5)","v":false},{"$f":"'Pers. Bil.'!F29","v":0},{"$f":"'Pers. Bil.'!H29","v":0},null,null,null,null,null,null,null,{"$f":"Bodro!#REF!-V36","v":{"$error":"#REF!"}},{"$f":"Bodro!#REF!+Bodro!#REF!","v":{"$error":"#REF!"}},649.74,{"$error":"#REF!"},null,{"$error":"#REF!"},{"$error":"#REF!"}]
[27,{"$f":"IF('Pers. Bil.'!D30=\"Ücretli Öğret.\",\"13\",\"05\")","v":"05"},"",null,{"$f":"IF('Pers. Bil.'!W30=\"\",0,'Pers. Bil.'!W30)","v":0},{"$f":"IF(E37<0,0,LEFT(SUBSTITUTE('Pers. Bil.'!C30,\" \",\"*\",LEN('Pers. Bil.'!C30)-LEN(SUBSTITUTE('Pers. Bil.'!C30,\" \",\"\"))),FIND(\"*\",SUBSTITUTE('Pers. Bil.'!C30,\" \",\"*\",LEN('Pers. Bil.'!C30)-LEN(SUBSTITUTE('Pers. Bil.'!C30,\" \",\"\"))),1)-1))","v":{"$error":"#VALUE!"}},{"$f":"IF(E37<0,0,MID('Pers. Bil.'!C30,LEN('XML Hes.'!F37)+2,LEN('Pers. Bil.'!C30)-LEN('XML Hes.'!F37)))","v":{"$error":"#VALUE!"}},null,{"$f":"IF('Pers. Bil.'!W30=\"\",0,'Pers. Bil.'!AD30)","v":0},null,{"$f":"IF('Pers. Bil.'!Z30+'Pers. Bil.'!AA30+'Pers. Bil.'!AB30>0,'Pers. Bil.'!Z30+'Pers. Bil.'!AA30+'Pers. Bil.'!AB30/7.5)","v":false},{"$f":"'Pers. Bil.'!F30","v":0},{"$f":"'Pers. Bil.'!H30","v":0},null,null,null,null,null,null,null,{"$f":"Bodro!#REF!-V37","v":{"$error":"#REF!"}},{"$f":"Bodro!#REF!+Bodro!#REF!","v":{"$error":"#REF!"}},1310.4000000000001,{"$error":"#REF!"},null,{"$error":"#REF!"},{"$error":"#REF!"}]
[28,{"$f":"IF('Pers. Bil.'!D31=\"Ücretli Öğret.\",\"13\",\"05\")","v":"05"},"",null,{"$f":"IF('Pers. Bil.'!W31=\"\",0,'Pers. Bil.'!W31)","v":0},{"$f":"IF(E38<0,0,LEFT(SUBSTITUTE('Pers. Bil.'!C31,\" \",\"*\",LEN('Pers. Bil.'!C31)-LEN(SUBSTITUTE('Pers. Bil.'!C31,\" \",\"\"))),FIND(\"*\",SUBSTITUTE('Pers. Bil.'!C31,\" \",\"*\",LEN('Pers. Bil.'!C31)-LEN(SUBSTITUTE('Pers. Bil.'!C31,\" \",\"\"))),1)-1))","v":{"$error":"#VALUE!"}},{"$f":"IF(E38<0,0,MID('Pers. Bil.'!C31,LEN('XML Hes.'!F38)+2,LEN('Pers. Bil.'!C31)-LEN('XML Hes.'!F38)))","v":{"$error":"#VALUE!"}},null,{"$f":"IF('Pers. Bil.'!W31=\"\",0,'Pers. Bil.'!AD31)","v":0},null,{"$f":"IF('Pers. Bil.'!Z31+'Pers. Bil.'!AA31+'Pers. Bil.'!AB31>0,'Pers. Bil.'!Z31+'Pers. Bil.'!AA31+'Pers. Bil.'!AB31/7.5)","v":false},{"$f":"'Pers. Bil.'!F31","v":0},{"$f":"'Pers. Bil.'!H31","v":0},null,null,null,null,null,null,null,{"$f":"Bodro!#REF!-V38","v":{"$error":"#REF!"}},{"$f":"Bodro!#REF!+Bodro!#REF!","v":{"$error":"#REF!"}},1310.4000000000001,{"$error":"#REF!"},null,{"$error":"#REF!"},{"$error":"#REF!"}]
[29,{"$f":"IF('Pers. Bil.'!D32=\"Ücretli Öğret.\",\"13\",\"05\")","v":"05"},"",null,{"$f":"IF('Pers. Bil.'!W32=\"\",0,'Pers. Bil.'!W32)","v":0},{"$f":"IF(E39<0,0,LEFT(SUBSTITUTE('Pers. Bil.'!C32,\" \",\"*\",LEN('Pers. Bil.'!C32)-LEN(SUBSTITUTE('Pers. Bil.'!C32,\" \",\"\"))),FIND(\"*\",SUBSTITUTE('Pers. Bil.'!C32,\" \",\"*\",LEN('Pers. Bil.'!C32)-LEN(SUBSTITUTE('Pers. Bil.'!C32,\" \",\"\"))),1)-1))","v":{"$error":"#VALUE!"}},{"$f":"IF(E39<0,0,MID('Pers. Bil.'!C32,LEN('XML Hes.'!F39)+2,LEN('Pers. Bil.'!C32)-LEN('XML Hes.'!F39)))","v":{"$error":"#VALUE!"}},null,{"$f":"IF('Pers. Bil.'!W32=\"\",0,'Pers. Bil.'!AD32)","v":0},null,{"$f":"IF('Pers. Bil.'!Z32+'Pers. Bil.'!AA32+'Pers. Bil.'!AB32>0,'Pers. Bil.'!Z32+'Pers. Bil.'!AA32+'Pers. Bil.'!AB32/7.5)","v":false},{"$f":"'Pers. Bil.'!F32","v":0},{"$f":"'Pers. Bil.'!H32","v":0},null,null,null,null,null,null,null,{"$f":"Bodro!#REF!-V39","v":{"$error":"#REF!"}},{"$f":"Bodro!#REF!+Bodro!#REF!","v":{"$error":"#REF!"}},1310.4000000000001,{"$error":"#REF!"},null,{"$error":"#REF!"},{"$error":"#REF!"}]
[30,{"$f":"IF('Pers. Bil.'!D33=\"Ücretli Öğret.\",\"13\",\"05\")","v":"05"},"",null,{"$f":"IF('Pers. Bil.'!W33=\"\",0,'Pers. Bil.'!W33)","v":0},{"$f":"IF(E40<0,0,LEFT(SUBSTITUTE('Pers. Bil.'!C33,\" \",\"*\",LEN('Pers. Bil.'!C33)-LEN(SUBSTITUTE('Pers. Bil.'!C33,\" \",\"\"))),FIND(\"*\",SUBSTITUTE('Pers. Bil.'!C33,\" \",\"*\",LEN('Pers. Bil.'!C33)-LEN(SUBSTITUTE('Pers. Bil.'!C33,\" \",\"\"))),1)-1))","v":{"$error":"#VALUE!"}},{"$f":"IF(E40<0,0,MID('Pers. Bil.'!C33,LEN('XML Hes.'!F40)+2,LEN('Pers. Bil.'!C33)-LEN('XML Hes.'!F40)))","v":{"$error":"#VALUE!"}},null,{"$f":"IF('Pers. Bil.'!W33=\"\",0,'Pers. Bil.'!AD33)","v":0},null,{"$f":"IF('Pers. Bil.'!Z33+'Pers. Bil.'!AA33+'Pers. Bil.'!AB33>0,'Pers. Bil.'!Z33+'Pers. Bil.'!AA33+'Pers. Bil.'!AB33/7.5)","v":false},{"$f":"'Pers. Bil.'!F33","v":0},{"$f":"'Pers. Bil.'!H33","v":0},null,null,null,null,null,null,null,{"$f":"Bodro!#REF!-V40","v":{"$error":"#REF!"}},{"$f":"Bodro!#REF!+Bodro!#REF!","v":{"$error":"#REF!"}},1202.24,{"$error":"#REF!"},null,{"$error":"#REF!"},{"$error":"#REF!"}]
[31,{"$f":"IF('Pers. Bil.'!D34=\"Ücretli Öğret.\",\"13\",\"05\")","v":"05"},"",null,{"$f":"IF('Pers. Bil.'!W34=\"\",0,'Pers. Bil.'!W34)","v":0},{"$f":"IF(E41<0,0,LEFT(SUBSTITUTE('Pers. Bil.'!C34,\" \",\"*\",LEN('Pers. Bil.'!C34)-LEN(SUBSTITUTE('Pers. Bil.'!C34,\" \",\"\"))),FIND(\"*\",SUBSTITUTE('Pers. Bil.'!C34,\" \",\"*\",LEN('Pers. Bil.'!C34)-LEN(SUBSTITUTE('Pers. Bil.'!C34,\" \",\"\"))),1)-1))","v":{"$error":"#VALUE!"}},{"$f":"IF(E41<0,0,MID('Pers. Bil.'!C34,LEN('XML Hes.'!F41)+2,LEN('Pers. Bil.'!C34)-LEN('XML Hes.'!F41)))","v":{"$error":"#VALUE!"}},null,{"$f":"IF('Pers. Bil.'!W34=\"\",0,'Pers. Bil.'!AD34)","v":0},null,{"$f":"IF('Pers. Bil.'!Z34+'Pers. Bil.'!AA34+'Pers. Bil.'!AB34>0,'Pers. Bil.'!Z34+'Pers. Bil.'!AA34+'Pers. Bil.'!AB34/7.5)","v":false},{"$f":"'Pers. Bil.'!F34","v":0},{"$f":"'Pers. Bil.'!H34","v":0},null,null,null,null,null,null,null,{"$f":"Bodro!#REF!-V41","v":{"$error":"#REF!"}},{"$f":"Bodro!#REF!+Bodro!#REF!","v":{"$error":"#REF!"}},1091.3499999999999,{"$error":"#REF!"},null,{"$error":"#REF!"},{"$error":"#REF!"}]
[32,{"$f":"IF('Pers. Bil.'!D35=\"Ücretli Öğret.\",\"13\",\"05\")","v":"05"},"",null,{"$f":"IF('Pers. Bil.'!W35=\"\",0,'Pers. Bil.'!W35)","v":0},{"$f":"IF(E42<0,0,LEFT(SUBSTITUTE('Pers. Bil.'!C35,\" \",\"*\",LEN('Pers. Bil.'!C35)-LEN(SUBSTITUTE('Pers. Bil.'!C35,\" \",\"\"))),FIND(\"*\",SUBSTITUTE('Pers. Bil.'!C35,\" \",\"*\",LEN('Pers. Bil.'!C35)-LEN(SUBSTITUTE('Pers. Bil.'!C35,\" \",\"\"))),1)-1))","v":{"$error":"#VALUE!"}},{"$f":"IF(E42<0,0,MID('Pers. Bil.'!C35,LEN('XML Hes.'!F42)+2,LEN('Pers. Bil.'!C35)-LEN('XML Hes.'!F42)))","v":{"$error":"#VALUE!"}},null,{"$f":"IF('Pers. Bil.'!W35=\"\",0,'Pers. Bil.'!AD35)","v":0},null,{"$f":"IF('Pers. Bil.'!Z35+'Pers. Bil.'!AA35+'Pers. Bil.'!AB35>0,'Pers. Bil.'!Z35+'Pers. Bil.'!AA35+'Pers. Bil.'!AB35/7.5)","v":false},{"$f":"'Pers. Bil.'!F35","v":0},{"$f":"'Pers. Bil.'!H35","v":0},null,null,null,null,null,null,null,{"$f":"Bodro!#REF!-V42","v":{"$error":"#REF!"}},{"$f":"Bodro!#REF!+Bodro!#REF!","v":{"$error":"#REF!"}},819,{"$error":"#REF!"},null,{"$error":"#REF!"},{"$error":"#REF!"}]
[33,{"$f":"IF('Pers. Bil.'!D36=\"Ücretli Öğret.\",\"13\",\"05\")","v":"05"},"",null,{"$f":"IF('Pers. Bil.'!W36=\"\",0,'Pers. Bil.'!W36)","v":0},{"$f":"IF(E43<0,0,LEFT(SUBSTITUTE('Pers. Bil.'!C36,\" \",\"*\",LEN('Pers. Bil.'!C36)-LEN(SUBSTITUTE('Pers. Bil.'!C36,\" \",\"\"))),FIND(\"*\",SUBSTITUTE('Pers. Bil.'!C36,\" \",\"*\",LEN('Pers. Bil.'!C36)-LEN(SUBSTITUTE('Pers. Bil.'!C36,\" \",\"\"))),1)-1))","v":{"$error":"#VALUE!"}},{"$f":"IF(E43<0,0,MID('Pers. Bil.'!C36,LEN('XML Hes.'!F43)+2,LEN('Pers. Bil.'!C36)-LEN('XML Hes.'!F43)))","v":{"$error":"#VALUE!"}},null,{"$f":"IF('Pers. Bil.'!W36=\"\",0,'Pers. Bil.'!AD36)","v":0},null,{"$f":"IF('Pers. Bil.'!Z36+'Pers. Bil.'!AA36+'Pers. Bil.'!AB36>0,'Pers. Bil.'!Z36+'Pers. Bil.'!AA36+'Pers. Bil.'!AB36/7.5)","v":false},{"$f":"'Pers. Bil.'!F36","v":0},{"$f":"'Pers. Bil.'!H36","v":0},null,null,null,null,null,null,null,{"$f":"Bodro!#REF!-V43","v":{"$error":"#REF!"}},{"$f":"Bodro!#REF!+Bodro!#REF!","v":{"$error":"#REF!"}},819,{"$error":"#REF!"},null,{"$error":"#REF!"},{"$error":"#REF!"}]
[34,{"$f":"IF('Pers. Bil.'!D37=\"Ücretli Öğret.\",\"13\",\"05\")","v":"05"},"",null,{"$f":"IF('Pers. Bil.'!W37=\"\",0,'Pers. Bil.'!W37)","v":0},{"$f":"IF(E44<0,0,LEFT(SUBSTITUTE('Pers. Bil.'!C37,\" \",\"*\",LEN('Pers. Bil.'!C37)-LEN(SUBSTITUTE('Pers. Bil.'!C37,\" \",\"\"))),FIND(\"*\",SUBSTITUTE('Pers. Bil.'!C37,\" \",\"*\",LEN('Pers. Bil.'!C37)-LEN(SUBSTITUTE('Pers. Bil.'!C37,\" \",\"\"))),1)-1))","v":{"$error":"#VALUE!"}},{"$f":"IF(E44<0,0,MID('Pers. Bil.'!C37,LEN('XML Hes.'!F44)+2,LEN('Pers. Bil.'!C37)-LEN('XML Hes.'!F44)))","v":{"$error":"#VALUE!"}},null,{"$f":"IF('Pers. Bil.'!W37=\"\",0,'Pers. Bil.'!AD37)","v":0},null,{"$f":"IF('Pers. Bil.'!Z37+'Pers. Bil.'!AA37+'Pers. Bil.'!AB37>0,'Pers. Bil.'!Z37+'Pers. Bil.'!AA37+'Pers. Bil.'!AB37/7.5)","v":false},{"$f":"'Pers. Bil.'!F37","v":0},{"$f":"'Pers. Bil.'!H37","v":0},null,null,null,null,null,null,null,{"$f":"Bodro!#REF!-V44","v":{"$error":"#REF!"}},{"$f":"Bodro!#REF!+Bodro!#REF!","v":{"$error":"#REF!"}},819,{"$error":"#REF!"},null,{"$error":"#REF!"},{"$error":"#REF!"}]
[35,{"$f":"IF('Pers. Bil.'!D38=\"Ücretli Öğret.\",\"13\",\"05\")","v":"05"},"",null,{"$f":"IF('Pers. Bil.'!W38=\"\",0,'Pers. Bil.'!W38)","v":0},{"$f":"IF(E45<0,0,LEFT(SUBSTITUTE('Pers. Bil.'!C38,\" \",\"*\",LEN('Pers. Bil.'!C38)-LEN(SUBSTITUTE('Pers. Bil.'!C38,\" \",\"\"))),FIND(\"*\",SUBSTITUTE('Pers. Bil.'!C38,\" \",\"*\",LEN('Pers. Bil.'!C38)-LEN(SUBSTITUTE('Pers. Bil.'!C38,\" \",\"\"))),1)-1))","v":{"$error":"#VALUE!"}},{"$f":"IF(E45<0,0,MID('Pers. Bil.'!C38,LEN('XML Hes.'!F45)+2,LEN('Pers. Bil.'!C38)-LEN('XML Hes.'!F45)))","v":{"$error":"#VALUE!"}},null,{"$f":"IF('Pers. Bil.'!W38=\"\",0,'Pers. Bil.'!AD38)","v":0},null,{"$f":"IF('Pers. Bil.'!Z38+'Pers. Bil.'!AA38+'Pers. Bil.'!AB38>0,'Pers. Bil.'!Z38+'Pers. Bil.'!AA38+'Pers. Bil.'!AB38/7.5)","v":false},{"$f":"'Pers. Bil.'!F38","v":0},{"$f":"'Pers. Bil.'!H38","v":0},null,null,null,null,null,null,null,{"$f":"Bodro!#REF!-V45","v":{"$error":"#REF!"}},{"$f":"Bodro!#REF!+Bodro!#REF!","v":{"$error":"#REF!"}},1089.4000000000001,{"$error":"#REF!"},null,{"$error":"#REF!"},{"$error":"#REF!"}]
[36,{"$f":"IF('Pers. Bil.'!D39=\"Ücretli Öğret.\",\"13\",\"05\")","v":"05"},"",null,{"$f":"IF('Pers. Bil.'!W39=\"\",0,'Pers. Bil.'!W39)","v":0},{"$f":"IF(E46<0,0,LEFT(SUBSTITUTE('Pers. Bil.'!C39,\" \",\"*\",LEN('Pers. Bil.'!C39)-LEN(SUBSTITUTE('Pers. Bil.'!C39,\" \",\"\"))),FIND(\"*\",SUBSTITUTE('Pers. Bil.'!C39,\" \",\"*\",LEN('Pers. Bil.'!C39)-LEN(SUBSTITUTE('Pers. Bil.'!C39,\" \",\"\"))),1)-1))","v":{"$error":"#VALUE!"}},{"$f":"IF(E46<0,0,MID('Pers. Bil.'!C39,LEN('XML Hes.'!F46)+2,LEN('Pers. Bil.'!C39)-LEN('XML Hes.'!F46)))","v":{"$error":"#VALUE!"}},null,{"$f":"IF('Pers. Bil.'!W39=\"\",0,'Pers. Bil.'!AD39)","v":0},null,{"$f":"IF('Pers. Bil.'!Z39+'Pers. Bil.'!AA39+'Pers. Bil.'!AB39>0,'Pers. Bil.'!Z39+'Pers. Bil.'!AA39+'Pers. Bil.'!AB39/7.5)","v":false},{"$f":"'Pers. Bil.'!F39","v":0},{"$f":"'Pers. Bil.'!H39","v":0},null,null,null,null,null,null,null,{"$f":"Bodro!#REF!-V46","v":{"$error":"#REF!"}},{"$f":"Bodro!#REF!+Bodro!#REF!","v":{"$error":"#REF!"}},1153.75,{"$error":"#REF!"},null,{"$error":"#REF!"},{"$error":"#REF!"}]
[37,{"$f":"IF('Pers. Bil.'!D40=\"Ücretli Öğret.\",\"13\",\"05\")","v":"05"},"",null,{"$f":"IF('Pers. Bil.'!W40=\"\",0,'Pers. Bil.'!W40)","v":0},{"$f":"IF(E47<0,0,LEFT(SUBSTITUTE('Pers. Bil.'!C40,\" \",\"*\",LEN('Pers. Bil.'!C40)-LEN(SUBSTITUTE('Pers. Bil.'!C40,\" \",\"\"))),FIND(\"*\",SUBSTITUTE('Pers. Bil.'!C40,\" \",\"*\",LEN('Pers. Bil.'!C40)-LEN(SUBSTITUTE('Pers. Bil.'!C40,\" \",\"\"))),1)-1))","v":{"$error":"#VALUE!"}},{"$f":"IF(E47<0,0,MID('Pers. Bil.'!C40,LEN('XML Hes.'!F47)+2,LEN('Pers. Bil.'!C40)-LEN('XML Hes.'!F47)))","v":{"$error":"#VALUE!"}},null,{"$f":"IF('Pers. Bil.'!W40=\"\",0,'Pers. Bil.'!AD40)","v":0},null,{"$f":"IF('Pers. Bil.'!Z40+'Pers. Bil.'!AA40+'Pers. Bil.'!AB40>0,'Pers. Bil.'!Z40+'Pers. Bil.'!AA40+'Pers. Bil.'!AB40/7.5)","v":false},{"$f":"'Pers. Bil.'!F40","v":0},{"$f":"'Pers. Bil.'!H40","v":0},null,null,null,null,null,null,null,{"$f":"Bodro!#REF!-V47","v":{"$error":"#REF!"}},{"$f":"Bodro!#REF!+Bodro!#REF!","v":{"$error":"#REF!"}},954.98,{"$error":"#REF!"},null,{"$error":"#REF!"},{"$error":"#REF!"}]
[38,{"$f":"IF('Pers. Bil.'!D41=\"Ücretli Öğret.\",\"13\",\"05\")","v":"05"},"",null,{"$f":"IF('Pers. Bil.'!W41=\"\",0,'Pers. Bil.'!W41)","v":0},{"$f":"IF(E48<0,0,LEFT(SUBSTITUTE('Pers. Bil.'!C41,\" \",\"*\",LEN('Pers. Bil.'!C41)-LEN(SUBSTITUTE('Pers. Bil.'!C41,\" \",\"\"))),FIND(\"*\",SUBSTITUTE('Pers. Bil.'!C41,\" \",\"*\",LEN('Pers. Bil.'!C41)-LEN(SUBSTITUTE('Pers. Bil.'!C41,\" \",\"\"))),1)-1))","v":{"$error":"#VALUE!"}},{"$f":"IF(E48<0,0,MID('Pers. Bil.'!C41,LEN('XML Hes.'!F48)+2,LEN('Pers. Bil.'!C41)-LEN('XML Hes.'!F48)))","v":{"$error":"#VALUE!"}},null,{"$f":"IF('Pers. Bil.'!W41=\"\",0,'Pers. Bil.'!AD41)","v":0},null,{"$f":"IF('Pers. Bil.'!Z41+'Pers. Bil.'!AA41+'Pers. Bil.'!AB41>0,'Pers. Bil.'!Z41+'Pers. Bil.'!AA41+'Pers. Bil.'!AB41/7.5)","v":false},{"$f":"'Pers. Bil.'!F41","v":0},{"$f":"'Pers. Bil.'!H41","v":0},null,null,null,null,null,null,null,{"$f":"Bodro!#REF!-V48","v":{"$error":"#REF!"}},{"$f":"Bodro!#REF!+Bodro!#REF!","v":{"$error":"#REF!"}},858,{"$error":"#REF!"},null,{"$error":"#REF!"},{"$error":"#REF!"}]
[39,{"$f":"IF('Pers. Bil.'!D42=\"Ücretli Öğret.\",\"13\",\"05\")","v":"05"},"",null,{"$f":"IF('Pers. Bil.'!W42=\"\",0,'Pers. Bil.'!W42)","v":0},{"$f":"IF(E49<0,0,LEFT(SUBSTITUTE('Pers. Bil.'!C42,\" \",\"*\",LEN('Pers. Bil.'!C42)-LEN(SUBSTITUTE('Pers. Bil.'!C42,\" \",\"\"))),FIND(\"*\",SUBSTITUTE('Pers. Bil.'!C42,\" \",\"*\",LEN('Pers. Bil.'!C42)-LEN(SUBSTITUTE('Pers. Bil.'!C42,\" \",\"\"))),1)-1))","v":{"$error":"#VALUE!"}},{"$f":"IF(E49<0,0,MID('Pers. Bil.'!C42,LEN('XML Hes.'!F49)+2,LEN('Pers. Bil.'!C42)-LEN('XML Hes.'!F49)))","v":{"$error":"#VALUE!"}},null,{"$f":"IF('Pers. Bil.'!W42=\"\",0,'Pers. Bil.'!AD42)","v":0},null,{"$f":"IF('Pers. Bil.'!Z42+'Pers. Bil.'!AA42+'Pers. Bil.'!AB42>0,'Pers. Bil.'!Z42+'Pers. Bil.'!AA42+'Pers. Bil.'!AB42/7.5)","v":false},{"$f":"'Pers. Bil.'!F42","v":0},{"$f":"'Pers. Bil.'!H42","v":0},null,null,null,null,null,null,null,{"$f":"Bodro!#REF!-V49","v":{"$error":"#REF!"}},{"$f":"Bodro!#REF!+Bodro!#REF!","v":{"$error":"#REF!"}},819,{"$error":"#REF!"},null,{"$error":"#REF!"},{"$error":"#REF!"}]
[40,{"$f":"IF('Pers. Bil.'!D43=\"Ücretli Öğret.\",\"13\",\"05\")","v":"05"},"",null,{"$f":"IF('Pers. Bil.'!W43=\"\",0,'Pers. Bil.'!W43)","v":0},{"$f":"IF(E50<0,0,LEFT(SUBSTITUTE('Pers. Bil.'!C43,\" \",\"*\",LEN('Pers. Bil.'!C43)-LEN(SUBSTITUTE('Pers. Bil.'!C43,\" \",\"\"))),FIND(\"*\",SUBSTITUTE('Pers. Bil.'!C43,\" \",\"*\",LEN('Pers. Bil.'!C43)-LEN(SUBSTITUTE('Pers. Bil.'!C43,\" \",\"\"))),1)-1))","v":{"$error":"#VALUE!"}},{"$f":"IF(E50<0,0,MID('Pers. Bil.'!C43,LEN('XML Hes.'!F50)+2,LEN('Pers. Bil.'!C43)-LEN('XML Hes.'!F50)))","v":{"$error":"#VALUE!"}},null,{"$f":"IF('Pers. Bil.'!W43=\"\",0,'Pers. Bil.'!AD43)","v":0},null,{"$f":"IF('Pers. Bil.'!Z43+'Pers. Bil.'!AA43+'Pers. Bil.'!AB43>0,'Pers. Bil.'!Z43+'Pers. Bil.'!AA43+'Pers. Bil.'!AB43/7.5)","v":false},{"$f":"'Pers. Bil.'!F43","v":0},{"$f":"'Pers. Bil.'!H43","v":0},null,null,null,null,null,null,null,{"$f":"Bodro!#REF!-V50","v":{"$error":"#REF!"}},{"$f":"Bodro!#REF!+Bodro!#REF!","v":{"$error":"#REF!"}},1021.02,{"$error":"#REF!"},null,{"$error":"#REF!"},{"$error":"#REF!"}]
[null,null,null,null,null,null,null,null,null,null,null,null,null,null,null,null,null,null,null,null,{"$f":"SUM(U11:U50)","v":{"$error":"#REF!"}},null,null,{"$f":"SUM(X11:X50)","v":{"$error":"#REF!"}}]
[]
[null,null,null,null,null,null,null,null,null,null,null,null,null,null,null,null,null,null,null,null,{"$f":"U51+X51","v":{"$error":"#REF!"}}]
[null,null,null,null,null,null,null,null,null,null,{"$f":"SUM(K11:K53)","v":{"$error":"#REF!"}}]

{"sheet":"Bildirge","index":6,"n_rows":54,"n_cols":19,"rows_kept":54,"cut":false,"hidden":false,"merged":[]}
[null,"İŞYERİ",null,null,null,null,null,"Sürüm:5.1","20130411_1646"]
[null,"Sicil No........................",null,null,"185310101118965100108",null,"Kontrol No...........","13",null,"Hazırlanacak XML dosya adını aşağıdaki alana giriniz"]
[null,"Aracı No.......................",null,null,"22",null,null,"",null,"d:\\e-Bildirge-03.2016.XML"]
[null,"Ünvan...........................",null,null,"İl Milli Eğitim Müdürlüğü",null,null,null,null,"Yüklenecek TEXT dosya adını aşağıdaki alana giriniz"]
[null,"Adres...........................",null,null,"Hacı Saki Mh. Osman Kavuncu Blv. No:40/B KAYSERİ",null,null,null,null,"C:\\YYY.TXT"]
[null,"Vergi No.......................",null,null,"6210037069"]
[null,"BORDRO",null,null,""]
[null,"Yıl (yyyy)......................",null,null,"2016",null,null,null,"DİKKAT:","Aşağıdaki Sigorta Bilgileri Belge Türü ve Kanun Bazında Gruplu Girilmelidir."]
[null,"Ay (aa).........................",null,null,"09",null,null,null,null,"Sigortalı Bilgileri Arasında Boş Satır Bırakılmamalıdır."]
[null,"Mahiyet.......................",null,null,"A","(Asıl için A, Ek için E, Toplu İş Sözleşmesi için T Giriniz)",null,null,null,"Bilgisayarınızın Varsayılan Bölgesel Ayarı Türkçe Olmalıdır."]
[null,null,null,null,null,null,null,null,null,null,null,"Prim","işe","işten","eksik","eksik","işten",null,"İstirahat"]
[null,"Sıra","Belge","Kanun","Sigortalı","SGNO (TC Kimlik)","Sigortalı Adı","Sigortalı Soyadı","Sigortalı","ÜCRET","İKRAMİYE","Öd.","giriş g.","çıkış g.","gün","gün","çıkış","Meslek","  Sürelerinde"]
[null,"No","Türü","No(5hane)","Sicil Numarası","Numarası (11hane)",null,null,"İlkSoyadı","TL","TL","Günü","GGAA","GGAA","sayısı","nedeni","nedeni","Kod","Çalışmamıştır"]
[null,1,"13","00000",null,10963368444,"FARUK","AVCI",null,287.24,null,2.9333333333333331,0,0]
[null,2,"13","00000",null,18601114484,"ESRA","BÜYÜK",null,313.35000000000002,null,3.2,0,0]
[null,3,"13","00000",null,20413057248,"GÖNÜL İNAN","KARA(ÇİFTÇİ)",null,195.84,null,2,0,0]
[null,4,"13","00000",null,16214480590,"ZEYNEP","ÇAMLI",null,221.96,null,2.2666666666666666,0,0]
[null,5]
[null,6]
[null,7]
[null,8]
[null,9]
[null,10]
[null,11]
[null,12]
[null,13]
[null,14]
[null,15]
[null,16]
[null,17]
[null,18]
[null,19]
[null,20]
[null,21]
[null,22]
[null,23]
[null,24]
[null,25]
[null,26]
[null,27]
[null,28]
[null,29]
[null,30]
[null,31]
[null,32]
[null,33]
[null,34]
[null,35]
[null,36]
[null,37]
[null,38]
[null,39]
[null,40]
[null,null,"Uyarı: Sayfa 500  sigortalı ile sınırlı değildir, 65000 sigortalı girişi yapılabilir. "]

{"sheet":"AGİ","index":7,"n_rows":60,"n_cols":25,"rows_kept":60,"cut":false,"hidden":false,"merged":[[4,0,4,3],[57,2,57,3],[58,2,58,3],[55,18,55,19],[53,17,53,20],[4,7,4,8]]}
[null,null,null,null,null,null,null,null,null,null,null,"ASGARİ GEÇİM İNDİRİMİNE AİT BORDRO"]
["Kurum Adı:",null,"Fatih Anadolu Lisesi"]
["Dönemi Ay/Yıl:",null,{"$f":"Bodro!U6","v":"Dönemi (Ay): EKİM"},null,null,null,null,null,null,null,null,null,null,null,null,null,null,null,null,null,null,"Sayfa :",1]
[null,null,null,null,null,null,null,null,null,null,null,null,null,null,null,null,null,null,null,null,null,null,"EK:2"]
["Personelin",null,null,null,null,null,"Asgarî Ücret Brüt Tutar :",{"$f":"Kur.Bil.!AL9","v":2029.5},null,null,null,null,null,null,null,null,"Yararlanılan Asgari Geçimi İndirimi Tutarı (*****) "]
["Sıra No","T.C. Kimlik No","Adı  Soyadı","Ünvanı","Medeni Hali","Çocuk Sayısı","AGİ Çal. ve Eş %'siİ","AGİ Çocuk %'si","Asgari Geçim İndirimi Oranı (%) (**)","As. Geç. İnd. Esas Tutar  (***)","Aylık As. Geç. İnd. Tutarı [(3.sütun) X % 15] 12   (****)",1,2,3,4,5,6,7,8,9,10,11,12,null,"Bodro AGİ Tutarı"]
[1,{"$f":"Bodro!B10","v":29867025728},{"$f":"Bodro!C10","v":"AHMET TOLGA ÇOBAN"},{"$f":"Bodro!D10","v":"Ücretli Öğret."},{"$f":"'Pers. Bil.'!O5","v":"Bekar"},{"$f":"'Pers. Bil.'!P5","v":0},{"$f":"'Pers. Bil.'!O5","v":"Bekar"},{"$f":"'Pers. Bil.'!P5","v":0},{"$f":"'Pers. Bil.'!AZ5","v":50},{"$f":"'Pers. Bil.'!BA5","v":12177},{"$f":"Bodro!AF10","v":0},{"$f":"Bodro!U10","v":0},null,null,null,null,null,null,null,null,null,null,null,null,{"$f":"Bodro!#REF!","v":{"$error":"#REF!"}}]
[2,{"$f":"Bodro!B11","v":28778061818},{"$f":"Bodro!C11","v":"FATMA NUR CİĞER"},{"$f":"Bodro!D11","v":"Ücretli Öğret."},{"$f":"'Pers. Bil.'!O6","v":"Bekar"},{"$f":"'Pers. Bil.'!P6","v":0},{"$f":"'Pers. Bil.'!O6","v":"Bekar"},{"$f":"'Pers. Bil.'!P6","v":0},{"$f":"'Pers. Bil.'!AZ6","v":50},{"$f":"'Pers. Bil.'!BA6","v":12177},{"$f":"Bodro!AF11","v":0},{"$f":"Bodro!U11","v":0},null,null,null,null,null,null,null,null,null,null,null,null,{"$f":"Bodro!#REF!","v":{"$error":"#REF!"}}]
[3,{"$f":"Bodro!B12","v":28481071876},{"$f":"Bodro!C12","v":"ZELİHA OKUMUŞ"},{"$f":"Bodro!D12","v":"Ücretli Öğret."},{"$f":"'Pers. Bil.'!O7","v":"Bekar"},{"$f":"'Pers. Bil.'!P7","v":0},{"$f":"'Pers. Bil.'!O7","v":"Bekar"},{"$f":"'Pers. Bil.'!P7","v":0},{"$f":"'Pers. Bil.'!AZ7","v":50},{"$f":"'Pers. Bil.'!BA7","v":12177},{"$f":"Bodro!AF12","v":0},{"$f":"Bodro!U12","v":0},null,null,null,null,null,null,null,null,null,null,null,null,{"$f":"Bodro!#REF!","v":{"$error":"#REF!"}}]
[4,{"$f":"Bodro!#REF!","v":{"$error":"#REF!"}},{"$f":"Bodro!#REF!","v":{"$error":"#REF!"}},{"$f":"Bodro!#REF!","v":{"$error":"#REF!"}},{"$f":"'Pers. Bil.'!#REF!","v":{"$error":"#REF!"}},{"$f":"'Pers. Bil.'!#REF!","v":{"$error":"#REF!"}},{"$f":"'Pers. Bil.'!#REF!","v":{"$error":"#REF!"}},{"$f":"'Pers. Bil.'!#REF!","v":{"$error":"#REF!"}},{"$f":"'Pers. Bil.'!#REF!","v":{"$error":"#REF!"}},{"$f":"'Pers. Bil.'!#REF!","v":{"$error":"#REF!"}},{"$f":"Bodro!#REF!","v":{"$error":"#REF!"}},{"$f":"Bodro!#REF!","v":{"$error":"#REF!"}},null,null,null,null,null,null,null,null,null,null,null,null,{"$f":"Bodro!#REF!","v":{"$error":"#REF!"}}]
[5,{"$f":"Bodro!B13","v":49891358388},{"$f":"Bodro!C13","v":"MUKADDES TABAK"},null,null,null,null,null,null,null,null,null,null,null,null,null,null,null,null,null,null,null,null,null,{"$f":"Bodro!#REF!","v":{"$error":"#REF!"}}]
[6,{"$f":"Bodro!B14","v":49462372478},null,null,null,null,null,null,null,null,null,null,null,null,null,null,null,null,null,null,null,null,null,null,{"$f":"Bodro!#REF!","v":{"$error":"#REF!"}}]
[7,{"$f":"Bodro!B15","v":0},null,null,null,null,null,null,null,null,null,null,null,null,null,null,null,null,null,null,null,null,null,null,{"$f":"Bodro!V10","v":0}]
[8,{"$f":"Bodro!B16","v":0},null,null,null,null,null,null,null,null,null,null,null,null,null,null,null,null,null,null,null,null,null,null,{"$f":"Bodro!V11","v":0}]
[9,{"$f":"Bodro!B20","v":0},{"$f":"Bodro!C20","v":0},null,null,null,null,null,null,null,null,null,null,null,null,null,null,null,null,null,null,null,null,null,{"$f":"Bodro!V20","v":0}]
[10,{"$f":"Bodro!B21","v":0},{"$f":"Bodro!C21","v":0},null,null,null,null,null,null,null,null,null,null,null,null,null,null,null,null,null,null,null,null,null,{"$f":"Bodro!V21","v":0}]
[11,{"$f":"Bodro!B22","v":0},{"$f":"Bodro!C22","v":0},null,null,null,null,null,null,null,null,null,null,null,null,null,null,null,null,null,null,null,null,null,{"$f":"Bodro!V22","v":0}]
[12,{"$f":"Bodro!B23","v":0},{"$f":"Bodro!C23","v":0},null,null,null,null,null,null,null,null,null,null,null,null,null,null,null,null,null,null,null,null,null,{"$f":"Bodro!V23","v":0}]
[13,{"$f":"Bodro!B24","v":0},{"$f":"Bodro!C24","v":0},null,null,null,null,null,null,null,null,null,null,null,null,null,null,null,null,null,null,null,null,null,{"$f":"Bodro!V24","v":0}]
[14,{"$f":"Bodro!B25","v":0},{"$f":"Bodro!C25","v":0},{"$f":"Bodro!D25","v":0},{"$f":"Bodro!X25","v":0},{"$f":"Bodro!Y25","v":0},{"$f":"Bodro!Z25","v":0},{"$f":"Bodro!AA25","v":0},{"$f":"Bodro!AB25","v":0},{"$f":"Bodro!AC25","v":0},{"$f":"Bodro!AD25","v":0},null,null,null,null,null,null,null,null,null,null,null,null,null,{"$f":"Bodro!V25","v":0}]
[15,{"$f":"Bodro!B26","v":0},{"$f":"Bodro!C26","v":0},{"$f":"Bodro!D26","v":0},{"$f":"Bodro!X26","v":0},{"$f":"Bodro!Y26","v":0},{"$f":"Bodro!Z26","v":0},{"$f":"Bodro!AA26","v":0},{"$f":"Bodro!AB26","v":0},{"$f":"Bodro!AC26","v":0},{"$f":"Bodro!AD26","v":0},null,null,null,null,null,null,null,null,null,null,null,null,null,{"$f":"Bodro!V26","v":0}]
[16,{"$f":"Bodro!B27","v":0},{"$f":"Bodro!C27","v":0},{"$f":"Bodro!D27","v":0},{"$f":"Bodro!X27","v":0},{"$f":"Bodro!Y27","v":0},{"$f":"Bodro!Z27","v":0},{"$f":"Bodro!AA27","v":0},{"$f":"Bodro!AB27","v":0},{"$f":"Bodro!AC27","v":0},{"$f":"Bodro!AD27","v":0},null,null,null,null,null,null,null,null,null,null,null,null,null,{"$f":"Bodro!V27","v":0}]
[17,{"$f":"Bodro!B28","v":0},{"$f":"Bodro!C28","v":0},{"$f":"Bodro!D28","v":0},{"$f":"Bodro!X28","v":0},{"$f":"Bodro!Y28","v":0},{"$f":"Bodro!Z28","v":0},{"$f":"Bodro!AA28","v":0},{"$f":"Bodro!AB28","v":0},{"$f":"Bodro!AC28","v":0},{"$f":"Bodro!AD28","v":0},null,null,null,null,null,null,null,null,null,null,null,null,null,{"$f":"Bodro!V28","v":0}]
[61,null,null,null,null,null,null,null,null,null,null,null,null,null,null,null,null,null,null,null,null,null,null,null,{"$f":"Bodro!#REF!","v":{"$error":"#REF!"}}]
[62,{"$f":"Bodro!B35","v":"Adı Soyadı :"},{"$f":"Bodro!C35","v":"Yasin CEPECİ"},{"$f":"Bodro!D35","v":0},{"$f":"Bodro!X35","v":0},{"$f":"Bodro!Y35","v":0},{"$f":"Bodro!Z35","v":0},{"$f":"Bodro!AA35","v":0},{"$f":"Bodro!AB35","v":0},{"$f":"Bodro!AC35","v":0},{"$f":"Bodro!AD35","v":0},null,null,null,null,null,null,null,null,null,null,null,null,null,{"$f":"Bodro!#REF!","v":{"$error":"#REF!"}}]
[63,{"$f":"Bodro!B36","v":"Ünvanı       :"},{"$f":"Bodro!C36","v":"Müdür Yrd."},{"$f":"Bodro!D36","v":0},{"$f":"Bodro!X36","v":0},{"$f":"Bodro!Y36","v":0},{"$f":"Bodro!Z36","v":0},{"$f":"Bodro!AA36","v":0},{"$f":"Bodro!AB36","v":0},{"$f":"Bodro!AC36","v":0},{"$f":"Bodro!AD36","v":0},null,null,null,null,null,null,null,null,null,null,null,null,null,{"$f":"Bodro!#REF!","v":{"$error":"#REF!"}}]
[64,{"$f":"Bodro!B37","v":"İmza          :"},{"$f":"Bodro!C37","v":"……………………………………"},{"$f":"Bodro!D37","v":0},{"$f":"Bodro!X37","v":0},{"$f":"Bodro!Y37","v":0},{"$f":"Bodro!Z37","v":0},{"$f":"Bodro!AA37","v":0},{"$f":"Bodro!AB37","v":0},{"$f":"Bodro!AC37","v":0},{"$f":"Bodro!AD37","v":0},null,null,null,null,null,null,null,null,null,null,null,null,null,{"$f":"Bodro!#REF!","v":{"$error":"#REF!"}}]
[65,{"$f":"Bodro!B38","v":0},{"$f":"Bodro!C38","v":0},{"$f":"Bodro!D38","v":0},{"$f":"Bodro!X38","v":0},{"$f":"Bodro!Y38","v":0},{"$f":"Bodro!Z38","v":0},{"$f":"Bodro!AA38","v":0},{"$f":"Bodro!AB38","v":0},{"$f":"Bodro!AC38","v":0},{"$f":"Bodro!AD38","v":0},null,null,null,null,null,null,null,null,null,null,null,null,null,{"$f":"Bodro!#REF!","v":{"$error":"#REF!"}}]
[66,{"$f":"Bodro!B39","v":0},{"$f":"Bodro!C39","v":0},{"$f":"Bodro!D39","v":0},{"$f":"Bodro!X39","v":0},{"$f":"Bodro!Y39","v":0},{"$f":"Bodro!Z39","v":0},{"$f":"Bodro!AA39","v":0},{"$f":"Bodro!AB39","v":0},{"$f":"Bodro!AC39","v":0},{"$f":"Bodro!AD39","v":0}]
[67,{"$f":"Bodro!B40","v":0},{"$f":"Bodro!C40","v":0},{"$f":"Bodro!D40","v":0},{"$f":"Bodro!X40","v":0},{"$f":"Bodro!Y40","v":0},{"$f":"Bodro!Z40","v":0},{"$f":"Bodro!AA40","v":0},{"$f":"Bodro!AB40","v":0},{"$f":"Bodro!AC40","v":0},{"$f":"Bodro!AD40","v":0}]
[68,{"$f":"Bodro!B41","v":0},{"$f":"Bodro!C41","v":0},{"$f":"Bodro!D41","v":0},{"$f":"Bodro!X41","v":0},{"$f":"Bodro!Y41","v":0},{"$f":"Bodro!Z41","v":0},{"$f":"Bodro!AA41","v":0},{"$f":"Bodro!AB41","v":0},{"$f":"Bodro!AC41","v":0},{"$f":"Bodro!AD41","v":0}]
[69,{"$f":"Bodro!#REF!","v":{"$error":"#REF!"}},{"$f":"Bodro!#REF!","v":{"$error":"#REF!"}},{"$f":"Bodro!#REF!","v":{"$error":"#REF!"}},{"$f":"Bodro!#REF!","v":{"$error":"#REF!"}},{"$f":"Bodro!#REF!","v":{"$error":"#REF!"}},{"$f":"Bodro!#REF!","v":{"$error":"#REF!"}},{"$f":"Bodro!#REF!","v":{"$error":"#REF!"}},{"$f":"Bodro!#REF!","v":{"$error":"#REF!"}},{"$f":"Bodro!#REF!","v":{"$error":"#REF!"}},{"$f":"Bodro!#REF!","v":{"$error":"#REF!"}}]
[70,{"$f":"Bodro!#REF!","v":{"$error":"#REF!"}},{"$f":"Bodro!#REF!","v":{"$error":"#REF!"}},{"$f":"Bodro!#REF!","v":{"$error":"#REF!"}},{"$f":"Bodro!#REF!","v":{"$error":"#REF!"}},{"$f":"Bodro!#REF!","v":{"$error":"#REF!"}},{"$f":"Bodro!#REF!","v":{"$error":"#REF!"}},{"$f":"Bodro!#REF!","v":{"$error":"#REF!"}},{"$f":"Bodro!#REF!","v":{"$error":"#REF!"}},{"$f":"Bodro!#REF!","v":{"$error":"#REF!"}},{"$f":"Bodro!#REF!","v":{"$error":"#REF!"}}]
[71,{"$f":"Bodro!#REF!","v":{"$error":"#REF!"}},{"$f":"Bodro!#REF!","v":{"$error":"#REF!"}},{"$f":"Bodro!#REF!","v":{"$error":"#REF!"}},{"$f":"Bodro!#REF!","v":{"$error":"#REF!"}},{"$f":"Bodro!#REF!","v":{"$error":"#REF!"}},{"$f":"Bodro!#REF!","v":{"$error":"#REF!"}},{"$f":"Bodro!#REF!","v":{"$error":"#REF!"}},{"$f":"Bodro!#REF!","v":{"$error":"#REF!"}},{"$f":"Bodro!#REF!","v":{"$error":"#REF!"}},{"$f":"Bodro!#REF!","v":{"$error":"#REF!"}}]
[72,{"$f":"Bodro!#REF!","v":{"$error":"#REF!"}},{"$f":"Bodro!#REF!","v":{"$error":"#REF!"}},{"$f":"Bodro!#REF!","v":{"$error":"#REF!"}},{"$f":"Bodro!#REF!","v":{"$error":"#REF!"}},{"$f":"Bodro!#REF!","v":{"$error":"#REF!"}},{"$f":"Bodro!#REF!","v":{"$error":"#REF!"}},{"$f":"Bodro!#REF!","v":{"$error":"#REF!"}},{"$f":"Bodro!#REF!","v":{"$error":"#REF!"}},{"$f":"Bodro!#REF!","v":{"$error":"#REF!"}},{"$f":"Bodro!#REF!","v":{"$error":"#REF!"}}]
[73,{"$f":"Bodro!#REF!","v":{"$error":"#REF!"}},{"$f":"Bodro!#REF!","v":{"$error":"#REF!"}},{"$f":"Bodro!#REF!","v":{"$error":"#REF!"}},{"$f":"Bodro!#REF!","v":{"$error":"#REF!"}},{"$f":"Bodro!#REF!","v":{"$error":"#REF!"}},{"$f":"Bodro!#REF!","v":{"$error":"#REF!"}},{"$f":"Bodro!#REF!","v":{"$error":"#REF!"}},{"$f":"Bodro!#REF!","v":{"$error":"#REF!"}},{"$f":"Bodro!#REF!","v":{"$error":"#REF!"}},{"$f":"Bodro!#REF!","v":{"$error":"#REF!"}}]
[74,{"$f":"Bodro!#REF!","v":{"$error":"#REF!"}},{"$f":"Bodro!#REF!","v":{"$error":"#REF!"}},{"$f":"Bodro!#REF!","v":{"$error":"#REF!"}},{"$f":"Bodro!#REF!","v":{"$error":"#REF!"}},{"$f":"Bodro!#REF!","v":{"$error":"#REF!"}},{"$f":"Bodro!#REF!","v":{"$error":"#REF!"}},{"$f":"Bodro!#REF!","v":{"$error":"#REF!"}},{"$f":"Bodro!#REF!","v":{"$error":"#REF!"}},{"$f":"Bodro!#REF!","v":{"$error":"#REF!"}},{"$f":"Bodro!#REF!","v":{"$error":"#REF!"}}]
[75,{"$f":"Bodro!#REF!","v":{"$error":"#REF!"}},{"$f":"Bodro!#REF!","v":{"$error":"#REF!"}},{"$f":"Bodro!#REF!","v":{"$error":"#REF!"}},{"$f":"Bodro!#REF!","v":{"$error":"#REF!"}},{"$f":"Bodro!#REF!","v":{"$error":"#REF!"}},{"$f":"Bodro!#REF!","v":{"$error":"#REF!"}},{"$f":"Bodro!#REF!","v":{"$error":"#REF!"}},{"$f":"Bodro!#REF!","v":{"$error":"#REF!"}},{"$f":"Bodro!#REF!","v":{"$error":"#REF!"}},{"$f":"Bodro!#REF!","v":{"$error":"#REF!"}}]
[76,{"$f":"Bodro!#REF!","v":{"$error":"#REF!"}},{"$f":"Bodro!#REF!","v":{"$error":"#REF!"}},{"$f":"Bodro!#REF!","v":{"$error":"#REF!"}},{"$f":"Bodro!#REF!","v":{"$error":"#REF!"}},{"$f":"Bodro!#REF!","v":{"$error":"#REF!"}},{"$f":"Bodro!#REF!","v":{"$error":"#REF!"}},{"$f":"Bodro!#REF!","v":{"$error":"#REF!"}},{"$f":"Bodro!#REF!","v":{"$error":"#REF!"}},{"$f":"Bodro!#REF!","v":{"$error":"#REF!"}},{"$f":"Bodro!#REF!","v":{"$error":"#REF!"}}]
[77,{"$f":"Bodro!#REF!","v":{"$error":"#REF!"}},{"$f":"Bodro!#REF!","v":{"$error":"#REF!"}},{"$f":"Bodro!#REF!","v":{"$error":"#REF!"}},{"$f":"Bodro!#REF!","v":{"$error":"#REF!"}},{"$f":"Bodro!#REF!","v":{"$error":"#REF!"}},{"$f":"Bodro!#REF!","v":{"$error":"#REF!"}},{"$f":"Bodro!#REF!","v":{"$error":"#REF!"}},{"$f":"Bodro!#REF!","v":{"$error":"#REF!"}},{"$f":"Bodro!#REF!","v":{"$error":"#REF!"}},{"$f":"Bodro!#REF!","v":{"$error":"#REF!"}}]
[78,{"$f":"Bodro!#REF!","v":{"$error":"#REF!"}},{"$f":"Bodro!#REF!","v":{"$error":"#REF!"}},{"$f":"Bodro!#REF!","v":{"$error":"#REF!"}},{"$f":"Bodro!#REF!","v":{"$error":"#REF!"}},{"$f":"Bodro!#REF!","v":{"$error":"#REF!"}},{"$f":"Bodro!#REF!","v":{"$error":"#REF!"}},{"$f":"Bodro!#REF!","v":{"$error":"#REF!"}},{"$f":"Bodro!#REF!","v":{"$error":"#REF!"}},{"$f":"Bodro!#REF!","v":{"$error":"#REF!"}},{"$f":"Bodro!#REF!","v":{"$error":"#REF!"}}]
[79,{"$f":"Bodro!B42","v":0},{"$f":"Bodro!C42","v":0},{"$f":"Bodro!D42","v":0},{"$f":"Bodro!X42","v":0},{"$f":"Bodro!Y42","v":0},{"$f":"Bodro!Z42","v":0},{"$f":"Bodro!AA42","v":0},{"$f":"Bodro!AB42","v":0},{"$f":"Bodro!AC42","v":0},{"$f":"Bodro!AD42","v":0}]
[80,{"$f":"Bodro!B43","v":0},{"$f":"Bodro!C43","v":0},{"$f":"Bodro!D43","v":0},{"$f":"Bodro!X43","v":0},{"$f":"Bodro!Y43","v":0},{"$f":"Bodro!Z43","v":0},{"$f":"Bodro!AA43","v":0},{"$f":"Bodro!AB43","v":0},{"$f":"Bodro!AC43","v":0},{"$f":"Bodro!AD43","v":0}]
[36,{"$f":"Bodro!#REF!","v":{"$error":"#REF!"}},{"$f":"Bodro!#REF!","v":{"$error":"#REF!"}},{"$f":"Bodro!#REF!","v":{"$error":"#REF!"}},{"$f":"Bodro!#REF!","v":{"$error":"#REF!"}},{"$f":"Bodro!#REF!","v":{"$error":"#REF!"}},{"$f":"Bodro!#REF!","v":{"$error":"#REF!"}},{"$f":"Bodro!#REF!","v":{"$error":"#REF!"}},{"$f":"Bodro!#REF!","v":{"$error":"#REF!"}},{"$f":"Bodro!#REF!","v":{"$error":"#REF!"}},{"$f":"Bodro!#REF!","v":{"$error":"#REF!"}}]
[37,{"$f":"Bodro!#REF!","v":{"$error":"#REF!"}},{"$f":"Bodro!#REF!","v":{"$error":"#REF!"}},{"$f":"Bodro!#REF!","v":{"$error":"#REF!"}},{"$f":"Bodro!#REF!","v":{"$error":"#REF!"}},{"$f":"Bodro!#REF!","v":{"$error":"#REF!"}},{"$f":"Bodro!#REF!","v":{"$error":"#REF!"}},{"$f":"Bodro!#REF!","v":{"$error":"#REF!"}},{"$f":"Bodro!#REF!","v":{"$error":"#REF!"}},{"$f":"Bodro!#REF!","v":{"$error":"#REF!"}},{"$f":"Bodro!#REF!","v":{"$error":"#REF!"}}]
[38,{"$f":"Bodro!#REF!","v":{"$error":"#REF!"}},{"$f":"Bodro!#REF!","v":{"$error":"#REF!"}},{"$f":"Bodro!#REF!","v":{"$error":"#REF!"}},{"$f":"Bodro!#REF!","v":{"$error":"#REF!"}},{"$f":"Bodro!#REF!","v":{"$error":"#REF!"}},{"$f":"Bodro!#REF!","v":{"$error":"#REF!"}},{"$f":"Bodro!#REF!","v":{"$error":"#REF!"}},{"$f":"Bodro!#REF!","v":{"$error":"#REF!"}},{"$f":"Bodro!#REF!","v":{"$error":"#REF!"}},{"$f":"Bodro!#REF!","v":{"$error":"#REF!"}}]
[39,{"$f":"Bodro!#REF!","v":{"$error":"#REF!"}},{"$f":"Bodro!#REF!","v":{"$error":"#REF!"}},{"$f":"Bodro!#REF!","v":{"$error":"#REF!"}},{"$f":"Bodro!#REF!","v":{"$error":"#REF!"}},{"$f":"Bodro!#REF!","v":{"$error":"#REF!"}},{"$f":"Bodro!#REF!","v":{"$error":"#REF!"}},{"$f":"Bodro!#REF!","v":{"$error":"#REF!"}},{"$f":"Bodro!#REF!","v":{"$error":"#REF!"}},{"$f":"Bodro!#REF!","v":{"$error":"#REF!"}},{"$f":"Bodro!#REF!","v":{"$error":"#REF!"}}]
[40,{"$f":"Bodro!#REF!","v":{"$error":"#REF!"}},{"$f":"Bodro!#REF!","v":{"$error":"#REF!"}},{"$f":"Bodro!#REF!","v":{"$error":"#REF!"}},{"$f":"Bodro!#REF!","v":{"$error":"#REF!"}},{"$f":"Bodro!#REF!","v":{"$error":"#REF!"}},{"$f":"Bodro!#REF!","v":{"$error":"#REF!"}},{"$f":"Bodro!#REF!","v":{"$error":"#REF!"}},{"$f":"Bodro!#REF!","v":{"$error":"#REF!"}},{"$f":"Bodro!#REF!","v":{"$error":"#REF!"}},{"$f":"Bodro!#REF!","v":{"$error":"#REF!"}}]
[null,null," SAYFA TOPLAMI",null,null,null,null,null,null,null,{"$f":"SUM(K7:K48)","v":{"$error":"#REF!"}},{"$f":"SUM(L7:L48)","v":{"$error":"#REF!"}},0,0,0,0,0,0,0,0,0,0,0,null,{"$f":"SUM(Y7:Y48)","v":{"$error":"#REF!"}}]
[null,"İl Milli Eğitim Müdürlüğünde görevli daimi kadrolu işçilere ait asgari geçim indirimi tutarı olarak "]
[null,{"$f":"tl_yaz(K49)","v":""},null,"tahakkuk ettirilmiştir."]
[]
[]
[null,null,"Düzenleyen",null,null,null,null,null,null,null,null,null,null,null,null,null,null,"Gerçekleştirme Görevlisi"]
[]
[null,null,{"$f":"TODAY()","v":"2018-10-09"},null,null,null,null,null,null,null,null,null,null,null,null,null,null,null,{"$f":"TODAY()","v":"2018-10-09"}]
[]
[null,"Adı Soyadı :",{"$f":"Kur.Bil.!$AE$12","v":"YASİN CEPECİ"},null,null,null,null,null,null,null,null,null,null,null,null,null,null,"Adı Soyadı :",{"$f":"Kur.Bil.!$AF$21","v":"MUSTAFA YILMAZ"}]
[null,"Ünvanı       :",{"$f":"Kur.Bil.!$AE$13","v":"MÜDÜR YARD."},null,null,null,null,null,null,null,null,null,null,null,null,null,null,"Ünvanı       :",{"$f":"Kur.Bil.!$AF$22","v":"OKUL MÜDÜRÜ"}]
[null,"İmza           :","…………………………………………….",null,null,null,null,null,null,null,null,null,null,null,null,null,null,"İmza           :","……………………………………………."]

{"sheet":"Banka List.","index":8,"n_rows":37,"n_cols":9,"rows_kept":37,"cut":false,"hidden":false,"merged":[[36,4,36,5],[33,4,33,5],[34,4,34,5],[30,4,30,6],[31,4,31,6],[32,4,32,6]]}
[null,null,null,null,"BANKA LİSTESİ"]
[null,null,null,null,null,null,null,null,"EK-1"]
[null,"Muhasebe Biriminin Adı",null,"Yahyalı Mal Müdürlüğü",null,null,"Muhasebe Biriminin Kodu",109]
[null,"Harcama Biriminin Adı",null,"Yahyalı Çok Programlı Anadolu Lisesi",null,null,"Harcama Biriminin Kodu","13.1.33.62.631"]
[null,"Banka Adı",null,"T.C. Vakıflar Bankası ",null,null,"Banka Şube Adı","Yahyalı Şubesi"]
[null,"Aylığın Ait Olduğu Yıl",null,{"$f":"Kur.Bil.!R9","v":2018},null,null,"Aylığın Ait Olduğu Ay",null,{"$f":"Kur.Bil.!R8","v":"EKİM"}]
[]
[null,null,null,null,"ALACAKLILARIN"]
[null,"Sıra No","T.C. Kimlik No","Adı - Soyadı","Unvanı","Banka Şube Kodu","Banka Hesap No","Banka  Hesap  IBAN No","Ödenecek Net Aylık Tutar"]
[null,1,{"$f":"'Pers. Bil.'!B5","v":29867025728},{"$f":"'Pers. Bil.'!C5","v":"AHMET TOLGA ÇOBAN"},{"$f":"'Pers. Bil.'!D5","v":"Ücretli Öğret."},{"$f":"'Pers. Bil.'!J5","v":158},{"$f":"'Pers. Bil.'!K5","v":0},"TR26 0001 5001 5800 7304 3656 42",168.9]
[null,2,{"$f":"'Pers. Bil.'!B6","v":28778061818},{"$f":"'Pers. Bil.'!C6","v":"FATMA NUR CİĞER"},{"$f":"'Pers. Bil.'!D6","v":"Ücretli Öğret."},{"$f":"'Pers. Bil.'!J6","v":158},{"$f":"'Pers. Bil.'!K6","v":0},"TR67 0001 5001 5800 7307 8944 43",619.29000000000008]
[null,3,{"$f":"'Pers. Bil.'!B7","v":28481071876},{"$f":"'Pers. Bil.'!C7","v":"ZELİHA OKUMUŞ"},{"$f":"'Pers. Bil.'!D7","v":"Ücretli Öğret."},{"$f":"'Pers. Bil.'!J7","v":158},{"$f":"'Pers. Bil.'!K7","v":0},"TR32 0001 5001 5800 7307 9020 57",760.03000000000009]
[null,5,{"$f":"'Pers. Bil.'!B8","v":49891358388},{"$f":"'Pers. Bil.'!C8","v":"MUKADDES TABAK"},{"$f":"'Pers. Bil.'!D8","v":"Ücretli Öğret."},{"$f":"'Pers. Bil.'!J8","v":158},{"$f":"'Pers. Bil.'!K8","v":0},"TR96 0001 5001 5800 7303 9304 04",197.05]
[null,6,{"$f":"'Pers. Bil.'!B9","v":49462372478},{"$f":"'Pers. Bil.'!C9","v":"VİLDAN GEYİK"},{"$f":"'Pers. Bil.'!D9","v":"Ücretli Öğret."},158,{"$f":"'Pers. Bil.'!K9","v":0},"TR28 0001 5001 5800 7307 8927 20 ",140.75]
[null,7,{"$f":"'Pers. Bil.'!B10","v":0},{"$f":"'Pers. Bil.'!C10","v":0},{"$f":"'Pers. Bil.'!D10","v":0},{"$f":"'Pers. Bil.'!J10","v":0},{"$f":"'Pers. Bil.'!K10","v":0},{"$f":"'Pers. Bil.'!L10","v":0},{"$f":"'Pers. Bil.'!AQ10","v":0}]
[null,8,{"$f":"'Pers. Bil.'!B11","v":0},{"$f":"'Pers. Bil.'!C11","v":0},{"$f":"'Pers. Bil.'!D11","v":0},{"$f":"'Pers. Bil.'!J11","v":0},{"$f":"'Pers. Bil.'!K11","v":0},{"$f":"'Pers. Bil.'!L11","v":0},{"$f":"'Pers. Bil.'!AQ11","v":0}]
[null,9,{"$f":"'Pers. Bil.'!B12","v":0},{"$f":"'Pers. Bil.'!C12","v":0},{"$f":"'Pers. Bil.'!D12","v":0},{"$f":"'Pers. Bil.'!J12","v":0},{"$f":"'Pers. Bil.'!K12","v":0},{"$f":"'Pers. Bil.'!L12","v":0},{"$f":"'Pers. Bil.'!AQ12","v":0}]
[null,10,{"$f":"'Pers. Bil.'!B13","v":0},{"$f":"'Pers. Bil.'!C13","v":0},{"$f":"'Pers. Bil.'!D13","v":0},{"$f":"'Pers. Bil.'!J13","v":0},{"$f":"'Pers. Bil.'!K13","v":0},{"$f":"'Pers. Bil.'!L13","v":0},{"$f":"'Pers. Bil.'!AQ13","v":0}]
[null,11,{"$f":"'Pers. Bil.'!B14","v":0},{"$f":"'Pers. Bil.'!C14","v":0},{"$f":"'Pers. Bil.'!D14","v":0},{"$f":"'Pers. Bil.'!J14","v":0},{"$f":"'Pers. Bil.'!K14","v":0},{"$f":"'Pers. Bil.'!L14","v":0},{"$f":"'Pers. Bil.'!AQ14","v":0}]
[null,12,{"$f":"'Pers. Bil.'!B15","v":0},{"$f":"'Pers. Bil.'!C15","v":0},{"$f":"'Pers. Bil.'!D15","v":0},{"$f":"'Pers. Bil.'!J15","v":0},{"$f":"'Pers. Bil.'!K15","v":0},{"$f":"'Pers. Bil.'!L15","v":0},{"$f":"'Pers. Bil.'!AQ15","v":0}]
[null,13,{"$f":"'Pers. Bil.'!B16","v":0},{"$f":"'Pers. Bil.'!C16","v":0},{"$f":"'Pers. Bil.'!D16","v":0},{"$f":"'Pers. Bil.'!J16","v":0},{"$f":"'Pers. Bil.'!K16","v":0},{"$f":"'Pers. Bil.'!L16","v":0},{"$f":"'Pers. Bil.'!AQ16","v":0}]
[null,14,{"$f":"'Pers. Bil.'!B17","v":0},{"$f":"'Pers. Bil.'!C17","v":0},{"$f":"'Pers. Bil.'!D17","v":0},{"$f":"'Pers. Bil.'!J17","v":0},{"$f":"'Pers. Bil.'!K17","v":0},{"$f":"'Pers. Bil.'!L17","v":0},{"$f":"'Pers. Bil.'!AQ17","v":0}]
[null,15,{"$f":"'Pers. Bil.'!B18","v":0},{"$f":"'Pers. Bil.'!C18","v":0},{"$f":"'Pers. Bil.'!D18","v":0},{"$f":"'Pers. Bil.'!J18","v":0},{"$f":"'Pers. Bil.'!K18","v":0},{"$f":"'Pers. Bil.'!L18","v":0},{"$f":"'Pers. Bil.'!AQ18","v":0}]
[null,16,{"$f":"'Pers. Bil.'!B19","v":0},{"$f":"'Pers. Bil.'!C19","v":0},{"$f":"'Pers. Bil.'!D19","v":0},{"$f":"'Pers. Bil.'!J19","v":0},{"$f":"'Pers. Bil.'!K19","v":0},{"$f":"'Pers. Bil.'!L19","v":0},{"$f":"'Pers. Bil.'!AQ19","v":0}]
[null,17,{"$f":"'Pers. Bil.'!B20","v":0},{"$f":"'Pers. Bil.'!C20","v":0},{"$f":"'Pers. Bil.'!D20","v":0},{"$f":"'Pers. Bil.'!J20","v":0},{"$f":"'Pers. Bil.'!K20","v":0},{"$f":"'Pers. Bil.'!L20","v":0},{"$f":"'Pers. Bil.'!AQ20","v":0}]
[null,18,{"$f":"'Pers. Bil.'!B21","v":0},{"$f":"'Pers. Bil.'!C21","v":0},{"$f":"'Pers. Bil.'!D21","v":0},{"$f":"'Pers. Bil.'!J21","v":0},{"$f":"'Pers. Bil.'!K21","v":0},{"$f":"'Pers. Bil.'!L21","v":0},{"$f":"'Pers. Bil.'!AQ21","v":0}]
[null,19,{"$f":"'Pers. Bil.'!B22","v":0},{"$f":"'Pers. Bil.'!C22","v":0},{"$f":"'Pers. Bil.'!D22","v":0},{"$f":"'Pers. Bil.'!J22","v":0},{"$f":"'Pers. Bil.'!K22","v":0},{"$f":"'Pers. Bil.'!L22","v":0},{"$f":"'Pers. Bil.'!AQ22","v":0}]
[null,20,{"$f":"'Pers. Bil.'!B23","v":0},{"$f":"'Pers. Bil.'!C23","v":0},{"$f":"'Pers. Bil.'!D23","v":0},{"$f":"'Pers. Bil.'!J23","v":0},{"$f":"'Pers. Bil.'!K23","v":0},{"$f":"'Pers. Bil.'!L23","v":0},{"$f":"'Pers. Bil.'!AQ23","v":0}]
[null,null,null,null,null,null,"T O P L A M",null,{"$f":"SUM(I10:I28)","v":1886.0200000000002}]
[]
[null,null,"Bordro Kayıtlarına Uygundur.  ",null,"Bordro Kayıtlarına Uygundur. ",null,null,null,"Kontrol edilmiştir."]
[null,null,"Gerçekleştirme Görevlisi",null,"Harcama Yetkilisi",null,null,null,"Muhasebe Yetkilisi"]
[null,null,{"$f":"TODAY()","v":"2018-10-09"},null,".10.2018",null,null,null,{"$f":"E33","v":".10.2018"}]
[null,null,"Yasin CEPECİ"]
[null,null,"Müd.yrd."]
[]
[null,null,"İmza ",null,null,null,null,null,"İmza "]

{"sheet":"Öd. Emri","index":9,"n_rows":62,"n_cols":42,"rows_kept":62,"cut":false,"hidden":false,"merged":[[57,15,57,23],[58,16,58,23],[44,27,44,34],[23,25,23,30],[23,19,23,24],[21,13,21,14],[22,13,22,14],[31,13,31,14],[32,13,32,14],[25,19,25,24],[25,25,25,30],[26,19,26,24],[26,25,26,30],[27,19,27,24],[27,25,27,30],[28,19,28,24],[28,25,28,30],[29,19,29,24],[29,25,29,30],[31,25,31,30],[32,25,32,30],[30,19,30,24],[30,25,30,30],[34,25,34,30],[35,19,35,24],[35,25,35,30],[36,19,36,24],[36,25,36,30],[34,19,34,24],[24,19,24,24],[24,25,24,30],[33,25,33,30],[33,19,33,24],[55,17,55,22],[43,0,44,3],[43,4,44,8],[43,9,44,12],[43,13,44,16],[43,17,44,20],[47,19,48,35],[55,31,55,33],[41,28,41,33],[41,21,42,24],[41,0,42,3],[41,4,42,8],[41,9,42,12],[41,13,42,16],[41,17,42,20],[43,27,43,34],[17,19,17,24],[17,25,17,30],[18,19,18,24],[18,25,18,30],[19,19,19,24],[19,25,19,30],[21,19,21,24],[21,25,21,30],[22,19,22,24],[20,19,20,24],[20,25,20,30],[22,25,22,30],[13,19,13,24],[13,25,13,30],[14,19,14,24],[14,25,14,30],[15,19,15,24],[15,25,15,30],[16,19,16,24],[16,25,16,30],[11,19,11,24],[11,25,11,30],[12,19,12,24],[12,25,12,30],[5,25,5,30],[6,25,6,30],[7,31,9,35],[8,19,9,24],[8,25,9,30],[1,0,1,3],[1,4,1,12],[2,0,2,3],[2,17,2,21],[2,22,6,24],[2,25,2,30],[3,0,4,3],[3,17,3,21],[3,25,3,30],[4,25,4,30],[7,0,10,3],[7,4,9,8],[7,9,9,12],[7,13,9,14],[7,15,9,18],[7,19,7,30],[33,13,33,14],[34,13,34,14],[10,13,10,14],[23,13,23,14],[24,13,24,14],[25,13,25,14],[26,13,26,14],[27,13,27,14],[28,13,28,14],[18,13,18,14],[19,13,19,14],[20,13,20,14],[11,13,11,14],[12,13,12,14],[13,13,13,14],[14,13,14,14],[15,13,15,14],[16,13,16,14],[17,13,17,14],[29,13,29,14],[30,13,30,14]]}
[null,null,null,null,null,null,null,null,null,null,null,null,null,null,null,null,null,null,null,null,"ÖDEME EMRİ BELGESİ",null,null,null,null,null,null,null,null,null,null,null,null,null,null,null,null,null,null,null,"EKDERS BORDROSU "]
["Muhasebe Birimi Kodu",null,null,null,null,null,null,null,null,null,null,null,null,null,null,null,null,null,null,null,null,null,null,null,null,null,null,null,null,null,null,null,null,null,null,null,null,null,null,null,"TAHAKKUK BÖLÜMÜ"]
["Muhasebe Birimi Adı",null,null,null,null,null,null,null,null,null,null,null,null,"Bütçe Yılı",null,null,null,{"$f":"TODAY()","v":"2018-10-09"},null,null,null,null,"İlgilinin",null,null,"Adı, Soyadı",null,null,null,null,null,null,null,null,null,null,null,null,null,null,"Ekders Saat Toplamı (%140 Göst.)",{"$f":"'Pers. Bil.'!Z24","v":20}]
["Kurum-Birim Kodu",null,null,null,1,2,3,4,5,"Yevmiyenin",null,null,null,"Tarihi",null,null,null,{"$f":"TODAY()","v":"2018-10-09"},null,null,null,null,null,null,null,"T.C./Vergi Kimlik No",null,null,null,null,null,null,null,null,null,null,null,null,null,null,"Ekders Saat Toplamı (%150 Göst.)",{"$f":"'Pers. Bil.'!AA24","v":0}]
[null,null,null,null,null,null,null,null,null,null,null,null,null,"No.su",null,null,null,null,null,null,null,null,null,null,null,"Banka Şube Adı",null,null,null,null,null,null,null,null,null,null,null,null,null,null,"Ekders Saat Toplamı (%140 Göst.x%25 Fazlası)",{"$f":"'Pers. Bil.'!AB24","v":0}]
["Kurum Adı",null,null,null,null,null,null,null,null,null,null,null,null,null,null,null,null,null,null,null,null,null,null,null,null,"Banka Hesap No",null,null,null,null,null,null,null,null,null,null,null,null,null,null,"TAHAKKUK TOPLAMI",{"$f":"'Pers. Bil.'!AC24","v":330.23}]
["Birim Adı",null,null,null,null,null,null,null,null,null,null,null,null,null,null,null,null,null,null,null,null,null,null,null,null,"İban Kodu.",null,null,null,null,null,null,null,null,null,null,null,null,null,null,"SGK MATRAH TOPLAMI",{"$f":"'Pers. Bil.'!AD24","v":330.23}]
["Hesap No",null,null,null,"Kurumsal Kod",null,null,null,null,"Forksiyonel Kod",null,null,null,"Finans Kodu",null,"Ekonomik/Y.Hesap Kodu",null,null,null,"T u t a r",null,null,null,null,null,null,null,null,null,null,null,"Hesap/Ayrıntı Adı",null,null,null,null,null,null,null,null,"SGK İşveren Payı (%20,5)",{"$f":"'Pers. Bil.'!AE24","v":67.7}]
[null,null,null,null,null,null,null,null,null,null,null,null,null,null,null,null,null,null,null,"B o r ç",null,null,null,null,null,"A l a c a k",null,null,null,null,null,null,null,null,null,null,null,null,null,null,"BRÜT TOPLAM",{"$f":"'Pers. Bil.'!AF24","v":397.93}]
[]
[null,null,null,null,1,2,3,4,5,1,2,3,4,1,null,1,2,3,4,null,null,null,null,"TL","Kr","TL",null,null,null,"TL","Kr",null,null,null,null,null,null,null,null,null,"Süregelen Yıllık Gelir Vergisi Toplamı",{"$f":"'Pers. Bil.'!AG24","v":0}]
[630,null,null,null,13,1,32,62,285,9,2,1,0,"1",null,"01","4","01","4",{"$f":"AP6","v":330.23},null,null,null,null,null,null,null,null,null,null,null,"Ücretli Öğretmen  Ekders Ücretleri",null,null,null,null,null,null,null,null,"Aylık Gelir Vergisi Matrah Toplamı",{"$f":"'Pers. Bil.'!AH24","v":284}]
[630,null,null,null,13,1,32,62,285,9,2,1,0,"1",null,"02","03","06","01",{"$f":"AP8","v":67.7},null,null,null,null,null,null,null,null,null,null,null,"Sosyal Güvenlik Primi Ödemeleri",null,null,null,null,null,null,null,null,"Gelir Vergisi Tutarı",{"$f":"'Pers. Bil.'!AI24","v":42.6}]
[630,null,null,null,13,1,32,62,285,9,2,1,0,"1",null,"12","01","01","09",{"$f":"AP20","v":42.6},null,null,null,null,null,null,null,null,null,null,null,"Ücretlerde Vergi İndirimi",null,null,null,null,null,null,null,null,"Damga Vergisi Tutarı",{"$f":"'Pers. Bil.'!AJ24","v":2.5099999999999998}]
[null,null,null,null,null,null,null,null,null,null,null,null,null,null,null,null,null,null,null,null,null,null,null,null,null,null,null,null,null,null,null,null,null,null,null,null,null,null,null,null,"SGK İşveren Payı (%20,5-%22,5)",{"$f":"'Pers. Bil.'!AK24","v":67.7}]
[600,null,null,null,null,null,null,null,null,null,null,null,null,null,null,"01","01","01","03",null,null,null,null,null,null,{"$f":"AP13","v":42.6},null,null,null,null,null,"Gelir Vergisi Tevkifatı",null,null,null,null,null,null,null,null,"SGK İşveren Payı (%14-%7,5)",{"$f":"'Pers. Bil.'!AL24","v":46.23}]
[600,null,null,null,null,null,null,null,null,null,null,null,null,null,null,"01","05","01","01",null,null,null,null,null,null,{"$f":"AP14","v":2.5099999999999998},null,null,null,null,null,"Damga Vergisi",null,null,null,null,null,null,null,null,"İcra Kesinti Tutarı",{"$f":"'Pers. Bil.'!AM24","v":0}]
[333,null,null,null,null,null,null,null,null,null,null,null,null,null,null,"03","01",null,null,null,null,null,null,null,null,{"$f":"AP17","v":0},null,null,null,null,null,"İcra Kesintisi",null,null,null,null,null,null,null,null,"Kesinti Toplamı",{"$f":"'Pers. Bil.'!AN24","v":159.04}]
[361,null,null,null,null,null,null,null,null,null,null,null,null,null,null,"10","01","02","01",null,null,null,null,null,null,{"$f":"AP15","v":67.7},null,null,null,null,null,"SGK Primleri İşveren Payı (Kurum)",null,null,null,null,null,null,null,null,"Ödeme Tutarı",{"$f":"'Pers. Bil.'!AO24","v":238.89000000000001}]
[361,null,null,null,null,null,null,null,null,null,null,null,null,null,null,"10","01","01","01",null,null,null,null,null,null,{"$f":"AP16","v":46.23},null,null,null,null,null,"SGK Primleri İştirakçi Payları (Kişi)",null,null,null,null,null,null,null,null,"As. Gec. İnd. Tutarı",{"$f":"'Pers. Bil.'!AP24","v":42.6}]
[null,null,null,null,null,null,null,null,null,null,null,null,null,null,null,null,null,null,null,null,null,null,null,null,null,null,null,null,null,null,null,null,null,null,null,null,null,null,null,null,"Ele Geçen Tutarı",{"$f":"'Pers. Bil.'!AQ24","v":281.49}]
[325,null,null,null,13,1,0,62,null,null,null,null,null,null,null,"01","12","01","00",null,null,null,null,null,null,{"$f":"(E44+J44)-N44","v":281.49},null,null,null,null,null,"15. Ödenecek Persınel Gideri"]
[]
[830,null,null,null,{"$f":"E12","v":13},{"$f":"F12","v":1},32,62,290,9,2,1,0,{"$f":"N12","v":"1"},null,{"$f":"P12","v":"01"},{"$f":"Q12","v":"4"},{"$f":"R12","v":"01"},{"$f":"S12","v":"4"},{"$f":"T12","v":330.23},null,null,null,null,null,null,null,null,null,null,null,{"$f":"AF12","v":"Ücretli Öğretmen  Ekders Ücretleri"}]
[830,null,null,null,{"$f":"E13","v":13},{"$f":"F13","v":1},{"$f":"G13","v":32},{"$f":"H13","v":62},290,{"$f":"J13","v":9},{"$f":"K13","v":2},{"$f":"L13","v":1},{"$f":"M13","v":0},{"$f":"N13","v":"1"},null,{"$f":"P13","v":"02"},"03","06","01",{"$f":"T13","v":67.7},null,null,null,null,null,null,null,null,null,null,null,{"$f":"AF13","v":"Sosyal Güvenlik Primi Ödemeleri"}]
[]
[835,null,null,null,null,null,null,null,null,null,null,null,null,null,null,"00","00","00","00",null,null,null,null,null,null,{"$f":"T24+T25","v":397.93},null,null,null,null,null,"GİDER YANSITMA HESABI"]
[]
[800,null,null,null,null,null,null,null,null,null,null,null,null,null,null,{"$f":"P16","v":"01"},"01","01","03",null,null,null,null,null,null,{"$f":"Z16","v":42.6},null,null,null,null,null,"Gelir Vergisi"]
[800,null,null,null,null,null,null,null,null,null,null,null,null,null,null,"01","05","01","01",null,null,null,null,null,null,{"$f":"Z17","v":2.5099999999999998},null,null,null,null,null,"Damga Vergisi"]
[805,null,null,null,null,null,null,null,null,null,null,null,null,null,null,"00","00","00","00",{"$f":"Z16+Z17","v":45.11},null,null,null,null,null,null,null,null,null,null,null,"GELİR YANSITMA HESABI"]
[805,null,null,null,null,null,null,null,null,null,null,null,null,null,null,"00","00","00","00",null,null,null,null,null,null,{"$f":"T14","v":42.6},null,null,null,null,null,"GELİR YANSITMA HESABI"]
[]
[810,null,null,null,{"$f":"E14","v":13},{"$f":"F14","v":1},{"$f":"G14","v":32},{"$f":"H14","v":62},null,{"$f":"J14","v":9},{"$f":"K14","v":2},{"$f":"L14","v":1},{"$f":"M14","v":0},null,null,{"$f":"P14","v":"12"},{"$f":"Q14","v":"01"},{"$f":"R14","v":"01"},{"$f":"S14","v":"09"},{"$f":"T14","v":42.6},null,null,null,null,null,null,null,null,null,null,null,{"$f":"AF14","v":"Ücretlerde Vergi İndirimi"}]
[]
["Toplam",null,null,null,null,null,null,null,null,null,null,null,null,null,null,null,null,null,null,{"$f":"SUM(T12:Y34)","v":926.17000000000007},null,null,null,null,null,{"$f":"SUM(Z12:Z34)","v":926.17000000000007}]
["Bütçe Giderleri Tahakkuk Toplamı",null,null,null,null,null,null,null,null,null,null,null,null,null,null,null,null,null,null,{"$f":"SUM(T12:Y14)","v":440.53000000000003},null,null,null,null,null,{"$f":"SUM(Z16:AE22)","v":440.53}]
[]
[{"$f":"\"Yukarıda Yazılı : \"&tl_yaz(T37)","v":"Yukarıda Yazılı : DörtYüzKırk TürkLirası ElliÜç Kuruş"},null,null,null,null,null,null,null,null,null,null,null,null,null,null,null,null,null,null,"Bütçe gideri tahakkuk ettirilmiştir. Ödenmesi / Mahsubu gerekir."]
[]
[null,null,null,null,null,null,null,null,null,null,null,null,null,null,null,null,null,null,null,null,null,null,null,null,null,null,null,null,null,null,null,"Kontrol Edilmiştir ve Uygun Görülmüştür."]
["Ödeme Emri Belgesi No.",null,null,null,"Bütçe Gideri Tahakkuk Toplamı",null,null,null,null,"Özel Gider İndirimi Toplamı",null,null,null,"Kesinti Toplamı",null,null,null,"Ödenmesi Gereken",null,null,null,"Çek/Gönderme Emri No",null,null,null,null,null,null,{"$f":"TODAY()","v":"2018-10-09"}]
[null,null,null,null,null,null,null,null,null,null,null,null,null,null,null,null,null,null,null,null,null,null,null,null,null,null,null,null,null,null,null,"Gerçekleştirme Görevlisi"]
[null,null,null,null,{"$f":"ROUND(T12+T13,2)","v":397.93},null,null,null,null,{"$f":"T14","v":42.6},null,null,null,{"$f":"SUM(Z16:AE20)","v":159.04},null,null,null,{"$f":"(E44-N44)+J44","v":281.49},null,null,null,null,null,null,null,null,null,"Osman BAYER"]
[null,null,null,null,null,null,null,null,null,null,null,null,null,null,null,null,null,null,null,null,null,null,null,null,null,null,null,"Müdür Yardımcısı"]
["Tetkik Eden"]
["Memur",null,null,null,null,"Şef",null,null,null,null,null,null,"Muhasebe Yetkilisi Yrd.",null,null,null,null,null,null,"Açıklama ve Ekler"]
[null,null,null,null,null,null,null,null,null,null,null,null,null,null,null,null,null,null,null,{"$f":"\"Fatih Anadolu Lisesi Müdürlüğü ücretli öğretmenlerine ait \"&Kur.Bil.!R8&\" dönemi ekders ücret ödeme evrakları.\"","v":"Fatih Anadolu Lisesi Müdürlüğü ücretli öğretmenlerine ait EKİM dönemi ekders ücret ödeme evrakları."}]
[]
["Ödemeye Esas Belgenin",null,null,null,null,null,null,null,null,null,null,null,null,null,null,null,null,null,null,1,"Bodro ",null,null,null,null,null,null,null,null,null,1,"Personel Bildirimi"]
["Türü",null,null,null,"Tarihi",null,null,null,null,"No.su",null,null,null,null,"Tutarı",null,null,null,null,1,"Devam Takip Çizelgesi ",null,null,null,null,null,null,null,null,null,2,"Banka Ödeme Listesi"]
[null,null,null,null,null,null,null,null,null,null,null,null,null,null,null,null,null,null,null,1,"AGİ Bodro ve ekleri",null,null,null,null,null,null,null,null,null,1,"E-Bildirge Tahakkuk Çıktısı"]
[]
[]
[null,null,null,null,null,null,null,null,null,null,null,null,null,null,null,null,null,null,null,"Uygundur",null,null,null,null,null,null,null,null,null,null,null,null,"Ödeyiniz/Mahsup Ediniz"]
[null,null,null,null,null,null,null,null,null,null,null,null,null,null,null,null,null,{"$f":"TODAY()","v":"2018-10-09"},null,null,null,null,null,null,null,null,null,null,null,null,null,{"$f":"R56","v":"2018-10-09"}]
[null,null,null,null,null,null,null,null,null,null,null,null,null,null,null,null,null,null,null,"Harcama Yetkilisi",null,null,null,null,null,null,null,null,null,null,null,null,"Muhasebe Yetkilisi"]
[null,null,null,null,null,null,null,null,null,null,null,null,null,null,null,"Ahmet OSMANCA"]
[null,null,null,null,null,null,null,null,null,null,null,null,null,null,null,null,"Okul Müdürü"]
[]
[]
[{"$f":"\"Yalnız : \"&tl_yaz(R44)","v":"Yalnız : İkiYüzSeksenBir TürkLirası KırkDokuz Kuruş"},null,null,null,null,null,null,null,null,null,null,null,null,null,null,null,null,null,null,"ilgili banka hesabına."]

{"sheet":"Açıklamalar 1","index":10,"n_rows":56,"n_cols":5,"rows_kept":56,"cut":false,"hidden":false,"merged":[[2,1,3,4]]}
[null,"  SGK (SSK) VE VERGİ KESİNTİLERİ TABLOSU     "]
[]
[null,"Sigorta Primlerinin Hesabına Esas Tutulacak Kazançların Aylık Tutarının Tespitinde Nazara Alınmayacak Olan Yemek Parası ile Çocuk ve Aile Zamlarının Günlük ve Aylık Tutarlarının Tespitine İlişkin Tebliğ"]
[]
[null,"Sigorta Primine Esas Olan ve Olmayan Kazançlar (Açıklamalı)"]
[]
[null,"ÖDEMENİN TÜRÜ","SSK","GELİR VERGİSİ","DAMGA VERGİSİ"]
[null,"Aile Yardımı","Tıklayınız ","Var","Yok"]
[null,"Asıl Ücret","Ssk Tavanı Var","Var","Var"]
[null,"Askerlik Yardımı","Var","Var","Var"]
[null,"Avanslar (ücret)","Yok","Kesilmiyor","Yok"]
[null,"Bayram Harçlığı","Var","Var","Var"]
[null,"Bayram Yardımı","Var","Var","Var"]
[null,"Çıraklık Ücreti","Yok","Sınırlı (Gvk 25/5)","Yok (3308 sayılı)"]
[null,"Çocuk Yardımı","Tıklayınız","Sınırlı (Gvk 25/4)","Yok"]
[null,"Doğum Yardımı","Yok","Sınırlı (Gvk 25/5)","Var"]
[null,"Eğitim Öğretim Yardımı","Var","Var","Var"]
[null,"Elbise Bedeli","Yok","Var Gvk 27/2 hrç","Var"]
[null,"Evlenme Yardımı","Yok","Sınırlı (Gvk 25/5)","Yok"]
[null,"Fazla Mesai","Var","Var","Var"]
[null,"Gece Zammı","Var","Var","Var"]
[null,"Giyecek Yardımı (Ayni)","Yok","Var","Yok"]
[null,"Giyecek Yardımı (Nakdi)","Var (4958/36)","Var","Var"]
[null,"Huzur Hakkı","Yok","Var","Var"]
[null,"İhbar Tazminatı","Yok","Var","Var"]
[null,"İkramiye","Var","Var","Var"]
[null,"İstirahat Yardımı","Yok","Var","Var"]
[null,"İş Riski Zammı","Var","Var","Var"]
[null,"İzin Harçlığı","Var","Var","Var"]
[null,"Jübile İkramiyesi","Yok","Var","Var"]
[null,"Kârdan hisse ücret","Var","Var","Var"]
[null,"Kasa Tazminatı","Yok","Var","Var"]
[null,"Kıdem Tazminatı","Yok","Sınırlı (Gvk 25/7)","Var"]
[null,"Konut (Nakdi)","Var","Var","Var"]
[null,"Konut Lojman","Yok","Sınırlı (Gvk 23/9)","Yok"]
[null,"Makam Tazminatı","Yok","Var","Var"]
[null,"Ölüm Yardımı","Yok","Yok","Var"]
[null,"Primler","Var","Var","Var"]
[null,"Sağlık Yardımı (ayni)","Yok","Yok","Yok"]
[null,"Sahıs Sigorta Primi","Yok","Sınırlı (Gvk 89)","Var"]
[null,"Satış Primi","Var","Var","Var"]
[null,"Tabii Afet Yardımı","Yok","Var","Var"]
[null,"Taşıt (Nakdi) Yol","Var","Var","Var"]
[null,"Taşıt (Servis)","Yok","Yok","Yok"]
[null,"Personelin evinden işe gelip gitmesi için abonman bileti verilmesi (belgelenmesi Şart)","Yok","Yok","Yok"]
[null,"Temettü İkramiyesi","Var","Var","Var"]
[null,"Temsil Ödeneği","Yok","Var","Var"]
[null,"Teşvik İkramiyesi","Var","Var Gvk 29/1 hrç","Var"]
[null,"Toplu Sözleşme Zam F.","Var","Var","Var"]
[null,"Yakacak (Ayni)","Yok","Var","Var"]
[null,"Yakacak (Nakdi)","Var 4958/36","Var","Var"]
[null,"Yemek (ayni)","Yok","Yok","Yok"]
[null,"Yemek (Nakdi)","Tıklayınız","Var","Var"]
[null,"Yılbaşı İkramiyesi","Var","Var","Var"]
[null,"Yıllık İzin Ücreti","Var","Var","Var"]
[null,"Yolluk","Yok","Sınırlı (Gvk 24/2)","Var"]

{"sheet":"Tah. Tes.","index":11,"n_rows":36,"n_cols":14,"rows_kept":36,"cut":false,"hidden":false,"merged":[[30,1,30,2],[30,11,30,12],[27,1,27,2],[20,3,20,4],[20,5,20,9],[21,5,21,9],[22,3,22,4],[22,5,22,9],[27,11,27,12],[28,1,28,2],[29,1,29,2],[29,11,29,12],[13,3,13,4],[13,5,13,9],[10,3,10,4],[11,3,11,4],[28,11,28,12],[14,3,14,4],[14,5,14,9],[15,3,15,4],[15,5,15,9],[16,3,16,4],[16,5,16,9],[9,3,9,4],[9,5,9,9],[10,5,10,9],[11,5,11,9],[12,3,12,4],[12,5,12,9],[6,13,7,13],[7,3,7,4],[7,5,7,9],[8,3,8,4],[8,5,8,9],[4,0,4,2],[4,3,4,7],[4,10,4,12],[6,0,7,0],[6,1,6,4],[6,5,6,10],[6,11,6,12],[1,0,1,13],[2,0,2,2],[2,10,2,13],[3,0,3,2],[3,3,3,7],[3,10,3,13]]}
[null,null,null,null,null,null,null,null,null,null,null,null,"EK-1"]
["ÖDEME BELGESİ VE EKİ BELGELER TESLİM/TESELLÜM TUTANAĞI"]
["Harcama Biriminin Kurumsal Kodu:",null,null,13,1,32,62,812,null,"Muhasebe Birimi:","KOZAN MAL MÜDÜRLÜĞÜ"]
["Dairesi:",null,null,"FATİH ANADOLU LİSESİ",null,null,null,null,null,"Düzenleme Tarihi:",{"$f":"TODAY()","v":"2018-10-09"}]
["Form Sıra No:",null,null,null,null,null,null,null,null,"Torba Numarası***:"]
[]
["Sıra No","Ödeme Belgesi",null,null,null,"Eki Belge",null,null,null,null,null,"Alacaklı",null,"Bütçe Gideri Tutarı"]
[null,"Tahakkuk İşlem No","Yevmiye Tarihi**","Yevmiye No**",null,"Türü*",null,null,null,null,"Sayfa","Adı-Soyadı","TCK/VNK"]
[1]
[2]
[3]
[4]
[5]
[6]
[7]
[8]
[9]
[10]
[11]
[12]
[13]
[14]
[15]
["Yukarıda alacaklıları ile alacak tutarları gösterilen toplam",null,null,null,null,null,"2 (İKİ )","adet tahakkuk evrakı ve ekleri teslim alınmıştır.",null,null,null,{"$f":"NOW()","v":"2018-10-09T16:48:55.170"}]
[]
[]
[]
[null,"TESLİM EDEN",null,null,null,null,null,null,null,null,null,"TESLİM ALAN"]
[]
[]
[]
[]
[]
["*Merkezi Yönetim Harcama Belgeleri Yönetmeliğindeki belgenin adı yazılacaktır."]
["** Bu bölümler muhasebe birimi tarafından muhasebeleştirme işlemi tamamlandıktan sonra doldurulacaktır."]
["*** Bu bölüme muhasebeleştirme işlemi tamamlandıktan sonra evrakın konulduğu torba numarası yazılacaktır."]